{"text_format":"1","workbook":"xlsx","n_sheets":22,"sheets":["PAGE0","PAGE0.1","PAGE1","PAGE2","PAGE3","PAGE4","PAGE5","PAGE6","PAGE7","PAGE9","PAGE10","Planilha1","PAGE1.1","PAGE2.1","PAGE3.1","PAGE 4.2","PAGE4.1","PAGE9.1","PAGE10.1","PAGE8","PAGE11.1","BASE TRAFO"],"not_rendered":{"charts":0,"images":29,"macros":1,"external_links":2,"defined_names":19,"comments":1,"pivot_tables":0},"unopened":[],"bounds":{"document_bytes":16777216,"sheet_cells":100000,"rows_first":2000,"rows_last":500,"rows_between":2000,"halvings":0,"cell_chars":16384,"cell_head_chars":4096},"cells_cut":0,"cells_raw":0,"read":"whole","date_system":"1900"}

{"sheet":"PAGE0","index":0,"n_rows":21,"n_cols":12,"rows_kept":21,"cut":false,"hidden":false,"merged":[[19,2,20,5],[20,11,20,12],[2,2,2,10],[5,8,5,10],[6,8,6,10],[8,6,9,11],[7,6,7,11],[14,6,15,11],[13,6,13,11]]}
[]
[]
[]
[]
[]
[]
{"$rows_left_out":16}
{"sheet":"PAGE0.1","index":1,"n_rows":22,"n_cols":12,"rows_kept":22,"cut":false,"hidden":false,"merged":[[20,3,20,10],[19,3,19,10],[21,11,21,12],[2,2,2,10],[5,3,5,10],[6,3,6,6],[6,7,6,10],[7,3,11,6],[7,7,11,10],[13,3,13,10],[21,5,21,8],[18,3,18,4],[16,5,16,10],[18,5,18,10],[17,3,17,4],[17,5,17,10],[14,3,15,10],[16,3,16,4]]}
[]
[]
[]
[]
[]
[null,null,null,"Texto para ser inserido no campo 5 da ART/TRT"]
{"$rows_left_out":17}
{"sheet":"PAGE1","index":2,"n_rows":35,"n_cols":15,"rows_kept":35,"cut":false,"hidden":false,"merged":[[23,4,23,6],[23,8,23,9],[23,10,23,13],[17,3,17,7],[19,3,19,4],[19,5,19,11],[21,4,21,6],[21,9,21,13],[17,9,17,10],[17,12,17,13],[31,3,31,8],[31,9,31,11],[34,14,34,15],[25,3,25,13],[27,3,27,11],[29,3,29,11],[29,12,29,13],[2,3,2,12],[4,3,4,13],[6,3,6,5],[6,6,6,8],[8,3,8,7],[8,9,8,13],[15,3,15,7],[12,9,12,12],[9,9,9,12],[9,3,9,7],[11,3,11,7],[11,9,11,13],[12,3,12,7],[14,3,14,7],[14,9,14,13],[15,9,15,12]]}
[]
[]
[]
[]
[null,null,null,"1 - Dados da Obra"]
[]
{"$rows_left_out":30}
{"sheet":"PAGE2","index":3,"n_rows":37,"n_cols":15,"rows_kept":37,"cut":false,"hidden":false,"merged":[[11,3,11,5],[11,6,11,7],[11,8,11,9],[11,10,11,11],[11,12,11,13],[31,3,32,10],[31,11,32,11],[31,13,34,15],[36,14,36,15],[19,3,19,13],[20,3,20,13],[23,3,23,13],[25,3,26,5],[25,6,26,6],[25,7,25,8],[25,9,26,13],[22,6,22,7],[22,8,22,9],[22,10,22,11],[22,12,22,13],[22,4,22,5],[28,3,29,10],[28,11,29,11],[16,3,16,5],[16,6,16,7],[16,8,16,9],[16,10,16,11],[16,12,16,13],[17,3,17,5],[17,6,17,7],[17,8,17,9],[17,10,17,11],[17,12,17,13],[14,3,14,5],[14,6,14,7],[14,8,14,9],[14,10,14,11],[14,12,14,13],[15,3,15,5],[15,6,15,7],[15,8,15,9],[15,10,15,11],[15,12,15,13],[12,3,12,5],[12,6,12,7],[12,8,12,9],[12,10,12,11],[12,12,12,13],[13,3,13,5],[13,6,13,7],[13,8,13,9],[13,10,13,11],[13,12,13,13],[10,6,10,7],[10,3,10,5],[2,3,2,12],[4,3,4,13],[8,3,8,7],[10,12,10,13],[10,10,10,11],[10,8,10,9],[6,3,6,7],[6,10,6,11],[7,10,7,11],[6,12,6,13],[7,12,7,13],[8,10,8,11]]}
[]
[]
[]
[]
[null,null,null,"3 - Quadros de Distribuição (QD)"]
[]
{"$rows_left_out":32}
{"sheet":"PAGE3","index":4,"n_rows":34,"n_cols":15,"rows_kept":34,"cut":false,"hidden":false,"merged":[[29,3,30,7],[25,3,25,7],[26,3,28,6],[26,7,28,7],[21,7,22,7],[21,3,22,6],[21,8,24,15],[17,8,18,12],[10,3,10,11],[12,3,12,7],[13,3,14,5],[13,6,14,6],[13,8,14,12],[6,3,6,7],[33,14,33,15],[2,3,2,12],[4,3,4,13],[7,13,8,13],[7,3,8,12],[17,13,18,13],[19,8,19,13],[20,3,20,7],[13,13,14,13],[9,3,9,11],[28,13,31,15],[15,8,15,13],[16,3,16,7],[17,3,18,5],[17,6,18,6]]}
[]
[]
[]
[]
[null,null,null,"4 - Informações da instalação"]
[]
{"$rows_left_out":29}
{"sheet":"PAGE4","index":5,"n_rows":22,"n_cols":14,"rows_kept":22,"cut":false,"hidden":false,"merged":[[21,13,21,14],[2,3,2,12],[5,9,5,12],[6,9,6,12],[6,3,6,6],[7,3,17,6]]}
[]
[null,null,{"$f":"IF(PAGE9!F7 = 43, \"1\", \"0\")","v":"0"}]
[]
[]
[]
[]
{"$rows_left_out":17}
{"sheet":"PAGE5","index":6,"n_rows":37,"n_cols":16,"rows_kept":37,"cut":false,"hidden":false,"merged":[[35,10,35,11],[34,10,34,11],[33,2,35,9],[6,7,6,12]]}
[]
[]
[]
[]
[]
[]
{"$rows_left_out":32}
{"sheet":"PAGE6","index":7,"n_rows":37,"n_cols":16,"rows_kept":37,"cut":false,"hidden":false,"merged":[[34,10,34,11],[35,10,35,11],[33,2,35,9]]}
[]
[]
[]
[]
[]
[]
{"$rows_left_out":32}
{"sheet":"PAGE7","index":8,"n_rows":37,"n_cols":16,"rows_kept":37,"cut":false,"hidden":false,"merged":[[35,10,35,11],[33,2,35,9],[34,10,34,11]]}
[]
[]
[]
[]
[]
[]
{"$rows_left_out":32}
{"sheet":"PAGE9","index":9,"n_rows":53,"n_cols":9,"rows_kept":53,"cut":false,"hidden":false,"merged":[[9,6,9,7]]}
[]
[]
[]
[]
[]
[null,null,null,null,"Total de itens:",40]
{"$rows_left_out":48}
{"sheet":"PAGE10","index":10,"n_rows":205,"n_cols":17,"rows_kept":205,"cut":false,"hidden":false,"merged":[[87,5,89,17],[1,2,1,4],[1,14,1,15],[1,11,1,13],[1,8,1,10],[48,4,48,17],[26,3,26,17],[7,7,7,11],[3,7,3,10],[3,11,3,13],[40,4,40,7],[36,3,36,10],[32,3,32,11],[43,16,43,17],[44,11,44,13],[41,4,41,7],[41,8,41,10],[41,11,41,13],[41,14,41,15],[41,16,41,17],[10,3,10,11],[12,3,12,6],[12,13,12,15],[34,3,34,17],[38,3,38,10],[40,11,40,13],[55,8,56,16],[45,4,45,7],[44,4,44,7],[43,4,43,7],[42,4,42,7],[47,4,47,7],[46,4,46,7],[51,3,51,17],[52,3,52,17],[49,4,49,17],[42,11,42,13],[42,14,42,15],[42,16,42,17],[43,11,43,13],[43,14,43,15],[44,14,44,15],[44,16,44,17],[45,11,45,13],[45,14,45,15],[45,16,45,17],[40,14,40,15],[40,16,40,17],[202,8,202,10],[203,8,203,10],[20,3,20,4],[24,5,24,10],[67,5,68,17],[69,5,69,17],[75,5,75,17],[73,5,73,17],[79,5,79,17],[81,5,81,17],[85,5,85,17],[92,5,92,17],[36,14,36,15],[38,14,38,15],[152,6,152,15],[101,6,101,15],[77,3,77,17],[65,3,65,17],[63,3,63,17],[60,5,61,17],[57,5,58,17],[54,5,54,13],[55,5,55,7],[32,15,32,16],[30,15,30,16],[15,3,15,6],[15,13,15,15],[198,16,198,17],[199,6,199,7],[199,14,199,15],[199,16,199,17],[196,6,196,7],[196,14,196,15],[186,6,186,7],[186,14,186,15],[182,6,182,7],[182,14,182,15],[186,16,186,17],[187,6,187,7],[187,14,187,15],[187,16,187,17],[184,6,184,7],[184,14,184,15],[184,16,184,17],[185,6,185,7],[196,16,196,17],[197,6,197,7],[197,14,197,15],[200,6,200,7],[200,14,200,15],[40,8,40,10],[42,8,42,10],[43,8,43,10],[44,8,44,10],[45,8,45,10],[46,8,46,10],[47,8,47,10],[83,3,83,17],[71,3,71,17],[46,11,46,13],[46,14,46,15],[46,16,46,17],[47,11,47,13],[47,14,47,15],[47,16,47,17],[120,14,120,15],[180,6,180,7],[180,14,180,15],[180,16,180,17],[181,6,181,7],[181,14,181,15],[181,16,181,17],[197,16,197,17],[188,6,188,7],[188,14,188,15],[188,16,188,17],[189,6,189,7],[189,14,189,15],[189,16,189,17],[194,6,194,7],[194,14,194,15],[194,16,194,17],[195,6,195,7],[195,14,195,15],[195,16,195,17],[200,16,200,17],[201,6,201,7],[201,14,201,15],[201,16,201,17],[198,6,198,7],[198,14,198,15],[185,14,185,15],[185,16,185,17],[182,16,182,17],[183,6,183,7],[183,14,183,15],[183,16,183,17],[190,6,190,7],[190,14,190,15],[190,16,190,17],[191,6,191,7],[191,14,191,15],[191,16,191,17],[192,6,192,7],[192,14,192,15],[192,16,192,17],[193,6,193,7],[193,14,193,15],[193,16,193,17],[164,14,164,15],[164,16,164,17],[171,6,171,7],[171,14,171,15],[171,16,171,17],[174,16,174,17],[175,6,175,7],[175,14,175,15],[175,16,175,17],[172,6,172,7],[172,14,172,15],[172,16,172,17],[173,6,173,7],[173,14,173,15],[173,16,173,17],[164,6,164,7],[174,6,174,7],[174,14,174,15],[166,6,166,7],[166,14,166,15],[166,16,166,17],[167,6,167,7],[167,14,167,15],[167,16,167,17],[162,16,162,17],[163,6,163,7],[163,14,163,15],[163,16,163,17],[160,6,160,7],[160,14,160,15],[160,16,160,17],[161,6,161,7],[161,14,161,15],[161,16,161,17],[162,6,162,7],[162,14,162,15],[154,6,154,7],[154,14,154,15],[158,16,158,17],[159,6,159,7],[159,14,159,15],[159,16,159,17],[156,6,156,7],[156,14,156,15],[156,16,156,17],[157,6,157,7],[157,14,157,15],[157,16,157,17],[158,6,158,7],[158,14,158,15],[139,16,139,17],[147,14,147,15],[148,14,148,15],[149,14,149,15],[139,14,139,15],[146,14,146,15],[152,16,152,17],[139,6,139,7],[129,16,129,17],[130,16,130,17],[131,16,131,17],[132,16,132,17],[133,16,133,17],[135,14,135,15],[136,14,136,15],[137,14,137,15],[138,14,138,15],[129,14,129,15],[130,14,130,15],[131,14,131,15],[132,14,132,15],[133,14,133,15],[134,14,134,15],[134,16,134,17],[124,6,124,7],[125,6,125,7],[122,6,122,7],[135,16,135,17],[136,16,136,17],[137,16,137,17],[138,16,138,17],[129,6,129,7],[130,6,130,7],[131,6,131,7],[132,6,132,7],[133,6,133,7],[134,6,134,7],[135,6,135,7],[136,6,136,7],[137,6,137,7],[138,6,138,7],[107,14,107,15],[108,14,108,15],[109,14,109,15],[110,16,110,17],[111,16,111,17],[112,16,112,17],[119,6,119,7],[114,14,114,15],[115,14,115,15],[116,14,116,15],[117,14,117,15],[118,14,118,15],[119,14,119,15],[114,16,114,17],[115,16,115,17],[116,16,116,17],[117,16,117,17],[118,16,118,17],[119,16,119,17],[5,3,5,17],[7,3,7,6],[9,3,9,6],[107,6,107,7],[108,6,108,7],[109,6,109,7],[110,6,110,7],[111,6,111,7],[100,14,100,15],[100,16,100,17],[101,16,101,17],[90,3,90,17],[100,6,100,7],[102,14,102,15],[102,16,102,17],[103,14,103,15],[104,14,104,15],[105,14,105,15],[102,6,102,7],[103,6,103,7],[104,6,104,7],[105,6,105,7],[103,16,103,17],[106,6,106,7],[16,13,16,15],[24,11,24,12],[22,11,22,12],[13,13,13,15],[10,13,10,15],[22,5,22,8],[20,5,20,14],[22,13,22,16],[24,13,24,16],[13,3,13,11],[16,3,16,11],[18,3,18,10],[18,12,18,13],[18,15,18,16],[95,8,95,10],[95,11,95,13],[96,8,96,10],[96,11,96,13],[114,6,114,7],[115,6,115,7],[116,6,116,7],[117,6,117,7],[118,6,118,7],[98,3,98,17],[113,16,113,17],[110,14,110,15],[112,6,112,7],[113,6,113,7],[104,16,104,17],[105,16,105,17],[106,16,106,17],[113,14,113,15],[107,16,107,17],[108,16,108,17],[109,16,109,17],[111,14,111,15],[112,14,112,15],[106,14,106,15],[140,6,140,7],[140,14,140,15],[140,16,140,17],[120,16,120,17],[121,16,121,17],[123,6,123,7],[120,6,120,7],[121,6,121,7],[121,14,121,15],[128,6,128,7],[128,14,128,15],[128,16,128,17],[122,16,122,17],[123,16,123,17],[124,16,124,17],[125,16,125,17],[127,16,127,17],[123,14,123,15],[124,14,124,15],[125,14,125,15],[126,16,126,17],[126,6,126,15],[127,6,127,15],[122,14,122,15],[150,14,150,15],[151,14,151,15],[141,6,141,7],[141,14,141,15],[141,16,141,17],[142,6,142,7],[142,14,142,15],[142,16,142,17],[143,6,143,7],[143,14,143,15],[143,16,143,17],[146,6,146,7],[147,6,147,7],[148,6,148,7],[149,6,149,7],[150,6,150,7],[151,6,151,7],[178,6,178,7],[178,14,178,15],[144,6,144,7],[144,14,144,15],[144,16,144,17],[145,6,145,7],[145,14,145,15],[145,16,145,17],[165,6,165,7],[165,14,165,15],[165,16,165,17],[154,16,154,17],[155,6,155,7],[155,14,155,15],[155,16,155,17],[153,6,153,7],[153,14,153,15],[153,16,153,17],[146,16,146,17],[147,16,147,17],[148,16,148,17],[149,16,149,17],[150,16,150,17],[151,16,151,17],[203,16,203,17],[202,16,202,17],[203,11,203,12],[202,11,202,12],[204,3,204,17],[97,3,97,17],[168,6,168,7],[168,14,168,15],[168,16,168,17],[169,6,169,7],[169,14,169,15],[169,16,169,17],[170,6,170,7],[170,14,170,15],[170,16,170,17],[178,16,178,17],[179,6,179,7],[179,14,179,15],[179,16,179,17],[176,6,176,7],[176,14,176,15],[176,16,176,17],[177,16,177,17],[177,6,177,15]]}
[false,false]
[null,null,"Versão 1.3",null,null,null,null,null,"Data de Impressão:",null,null,{"$f":"NOW()","v":"2024-10-04T11:47:26.860"}]
[]
[]
[]
[null,null,null,"1 - Dados da obra"]
{"$rows_left_out":200}
{"sheet":"Planilha1","index":11,"n_rows":12,"n_cols":9,"rows_kept":12,"cut":false,"hidden":true,"merged":[]}
[]
[]
[]
[]
[]
[]
{"$rows_left_out":7}
{"sheet":"PAGE1.1","index":12,"n_rows":38,"n_cols":15,"rows_kept":38,"cut":false,"hidden":false,"merged":[[37,14,37,15],[24,3,24,7],[24,9,24,10],[24,12,24,13],[26,3,26,13],[28,3,28,11],[32,3,32,11],[32,12,32,13],[34,3,34,8],[34,9,34,11],[30,3,30,11],[15,3,15,8],[20,4,20,6],[20,9,20,13],[22,4,22,6],[22,8,22,9],[22,10,22,13],[6,12,6,13],[18,3,18,4],[18,5,18,11],[2,3,2,12],[4,3,4,13],[6,3,6,5],[6,6,6,8],[17,3,17,7],[11,3,11,7],[8,3,8,7],[14,3,14,7],[15,10,15,13],[9,10,9,13],[12,10,12,13],[9,3,9,8],[12,3,12,8]]}
[]
[]
[]
[]
[null,null,null,"1 - Dados da obra"]
[]
{"$rows_left_out":33}
{"sheet":"PAGE2.1","index":13,"n_rows":40,"n_cols":25,"rows_kept":40,"cut":false,"hidden":false,"merged":[[18,12,20,12],[18,13,20,13],[30,12,32,12],[30,13,32,13],[22,12,24,12],[39,13,39,14],[18,3,32,3],[22,8,24,8],[26,8,28,8],[30,8,32,8],[18,5,20,6],[21,5,24,6],[26,5,28,6],[29,5,32,6],[18,8,20,8],[26,12,28,12],[22,13,24,13],[26,13,28,13],[26,9,28,10],[30,11,32,11],[18,11,20,11],[2,3,2,11],[4,3,4,12],[16,5,16,6],[16,8,16,10],[12,3,12,5],[8,3,8,5],[6,3,6,6],[7,3,7,7],[10,6,10,8],[8,8,8,11],[14,3,14,11],[16,12,16,13],[12,7,12,8],[22,11,24,11],[26,11,28,11],[28,7,30,7],[35,3,35,10],[36,3,36,10],[34,3,34,10],[20,7,22,7],[18,9,20,10],[22,9,24,10],[30,9,32,10],[22,4,28,4],[4,19,5,19],[4,20,4,21],[4,22,5,22],[4,23,4,24],[13,3,13,5],[13,7,13,8],[4,17,5,17],[4,18,5,18],[8,13,8,14],[11,6,11,8]]}
[]
[]
[]
[]
[null,null,null,"3 - Dados Técnicos",null,null,null,null,null,null,null,null,null,null,null,null,null,"Potência nominal","Disjuntor (A)","Isolação PVC 70º C (mm²)","Eletroduto diâmetro nominal (mm)",null,"Isolação EPR/XLPE 90º C (mm²)","Eletroduto diâmetro nominal (mm)"]
[null,null,null,null,null,null,null,null,null,null,null,null,null,null,null,null,null,null,null,null,"PVC","AÇO",null,"PVC","AÇO"]
{"$rows_left_out":35}
{"sheet":"PAGE3.1","index":14,"n_rows":51,"n_cols":15,"rows_kept":51,"cut":false,"hidden":false,"merged":[[24,5,24,13],[26,5,26,13],[50,14,50,15],[32,5,34,13],[38,5,39,13],[44,5,44,12],[43,5,43,8],[43,11,43,13],[43,9,43,10],[46,5,48,12],[2,3,2,12],[4,3,4,13],[19,5,20,13],[13,5,13,13],[15,5,15,13],[17,5,17,13],[6,3,6,5],[8,3,8,13],[10,5,10,13]]}
[]
[]
[]
[]
[null,null,null,"4 - Informações da instalação"]
[]
{"$rows_left_out":46}
{"sheet":"PAGE 4.2","index":15,"n_rows":79,"n_cols":83,"rows_kept":79,"cut":false,"hidden":false,"merged":[[78,23,81,72],[95,62,97,62],[49,38,54,44],[49,50,54,56],[59,38,61,46],[59,48,61,56],[66,47,68,47],[72,41,75,53],[13,7,16,88],[18,12,61,13],[18,82,61,83],[21,19,26,40],[22,44,24,50],[26,44,36,50],[40,48,45,54],[46,31,61,35],[46,59,61,64]]}
[]
[]
[]
[]
[]
[]
{"$rows_left_out":74}
{"sheet":"PAGE4.1","index":16,"n_rows":22,"n_cols":15,"rows_kept":22,"cut":false,"hidden":false,"merged":[[2,3,2,12],[5,10,5,12],[6,10,6,12],[21,14,21,15],[6,3,6,7],[7,3,17,7],[18,3,18,7]]}
[]
[null,null,{"$f":"IF(PAGE9.1!F7 = 37, \"1\", \"0\")","v":"0"}]
[]
[]
[]
[]
{"$rows_left_out":17}
{"sheet":"PAGE9.1","index":17,"n_rows":47,"n_cols":9,"rows_kept":47,"cut":false,"hidden":false,"merged":[[9,6,9,7]]}
[]
[]
[]
[]
[]
[null,null,null,null,"Total de itens:",37]
{"$rows_left_out":42}
{"sheet":"PAGE10.1","index":18,"n_rows":227,"n_cols":14,"rows_kept":227,"cut":false,"hidden":false,"merged":[[172,5,172,9],[172,10,172,13],[179,5,179,9],[179,10,179,13],[180,5,180,9],[180,10,180,13],[181,5,181,9],[181,10,181,13],[182,5,182,9],[182,10,182,13],[160,5,160,9],[160,10,160,13],[161,5,161,9],[161,10,161,13],[162,5,162,9],[162,10,162,13],[163,5,163,9],[163,10,163,13],[171,5,171,9],[171,10,171,13],[155,5,155,9],[155,10,155,13],[156,5,156,9],[156,10,156,13],[157,5,157,9],[157,10,157,13],[158,5,158,9],[158,10,158,13],[159,5,159,9],[159,10,159,13],[150,5,150,9],[150,10,150,13],[151,5,151,9],[151,10,151,13],[152,5,152,9],[152,10,152,13],[153,5,153,9],[153,10,153,13],[154,5,154,9],[154,10,154,13],[199,3,202,3],[203,3,204,3],[119,3,119,13],[161,3,189,3],[190,3,192,3],[193,3,195,3],[196,3,198,3],[204,5,204,13],[189,5,191,13],[195,5,196,13],[200,5,200,8],[200,9,200,10],[200,11,200,13],[184,6,184,10],[145,5,145,9],[145,10,145,13],[146,5,146,9],[146,10,146,13],[147,5,147,9],[147,10,147,13],[148,5,148,9],[148,10,148,13],[149,5,149,9],[149,10,149,13],[116,5,116,13],[120,5,120,13],[122,5,123,13],[59,10,61,10],[61,8,63,8],[62,6,65,7],[63,9,65,9],[51,10,53,10],[53,8,55,8],[55,13,57,13],[67,3,67,10],[68,3,68,10],[96,5,98,13],[102,5,103,13],[81,5,81,13],[83,5,83,13],[85,5,86,13],[90,5,90,13],[92,5,92,13],[69,3,69,10],[51,6,53,7],[54,6,57,7],[31,3,31,11],[37,3,37,13],[39,3,39,7],[41,3,41,7],[47,3,47,13],[1,2,1,3],[110,5,110,13],[41,10,41,12],[107,5,107,8],[107,9,107,10],[107,11,107,13],[71,3,71,13],[73,3,73,5],[75,3,75,13],[79,5,79,13],[77,5,77,13],[51,3,65,4],[49,3,49,4],[59,6,61,7],[59,9,61,9],[63,10,65,10],[63,12,65,12],[63,13,65,13],[55,12,57,12],[4,3,4,13],[6,3,6,5],[6,6,6,8],[9,10,9,13],[9,3,9,8],[7,3,7,5],[7,6,7,8],[27,3,27,13],[29,3,29,11],[25,9,25,10],[25,12,25,13],[23,4,23,6],[23,8,23,9],[23,10,23,13],[25,3,25,7],[49,6,49,7],[51,9,53,9],[33,12,33,13],[55,5,61,5],[55,9,57,9],[55,10,57,10],[45,3,45,7],[43,3,43,7],[49,12,49,13],[35,3,35,8],[35,9,35,11],[51,12,54,12],[51,13,54,13],[59,12,62,12],[59,13,62,13],[49,9,49,10],[226,3,228,13],[223,7,223,8],[223,9,223,10],[224,3,224,13],[222,2,222,3],[222,7,222,8],[222,9,222,10],[1,7,1,8],[1,9,1,10],[33,3,33,11],[19,5,19,11],[19,3,19,4],[2,3,2,12],[8,3,8,7],[11,3,11,7],[12,3,12,8],[12,10,12,13],[14,3,14,7],[15,3,15,8],[15,10,15,13],[17,3,17,7],[21,4,21,6],[21,9,21,13],[43,8,43,10]]}
[]
[null,null,"Versão 1.3",null,null,null,null,"Data de Impressão:",null,{"$f":"NOW()","v":"2024-10-04T11:47:26.860"}]
[]
[]
[null,null,null,"1 - Dados da obra"]
[]
{"$rows_left_out":222}
{"sheet":"PAGE8","index":19,"n_rows":70,"n_cols":10,"rows_kept":70,"cut":false,"hidden":false,"merged":[[12,9,12,10],[9,0,9,2],[9,9,9,10],[10,0,10,1],[10,9,10,10],[11,0,11,1],[11,9,11,10],[1,0,1,3],[1,5,1,9],[2,0,2,1],[3,3,8,3],[4,1,4,2],[8,1,8,2],[13,0,13,2],[13,9,13,10],[14,9,14,10],[15,9,15,10],[18,0,18,3],[18,5,18,9],[19,5,19,6],[23,5,23,6],[27,5,27,6],[30,2,31,2],[31,5,31,6],[33,0,33,3],[34,0,34,1],[38,0,38,1],[39,5,39,6],[42,0,42,1],[49,5,49,6],[49,7,49,8],[49,9,49,10],[50,9,50,10],[51,9,51,10],[52,9,52,10],[53,9,53,10],[54,9,54,10],[57,5,57,6],[57,7,57,8],[57,9,57,10],[58,9,58,10],[59,9,59,10],[60,9,60,10],[61,9,61,10],[62,9,62,10],[68,6,68,7],[69,6,69,7],[65,0,65,3],[65,5,65,9],[66,6,66,7],[67,0,67,1],[67,2,67,3],[67,6,67,7]]}
["GERAL",{"$f":"A50","v":"CDM - 1"},{"$f":"E50","v":"CDM - 2"},{"$f":"E58","v":"CDM - 3"}]
["DIMENSIONAMENTO DOS COMPONENTES"]
["Entrada de Serviço"]
["Dem. Total:",{"$f":"IF(#REF!=B1,B50,IF(#REF!=C1,E51,IF(#REF!=D1,E59,(B31*B32)+J21+E36)))","v":{"$error":"#REF!"}},"kVA","Entrada das UCs","Condomínio","1F",{"$f":"IF(F4=\"3F\",J21,J22)","v":0},{"$f":"IF($G4=0,0,IF($F4=\"1F\",INDEX([2]Tabelas!$P$4:$P$5,MATCH($G4,[2]Tabelas!$L$4:$L$5,1),),INDEX([2]Tabelas!$P$6:$P$9,MATCH($G4,[2]Tabelas!$N$6:$N$9,1),)))","v":0},{"$f":"IF($G4=0,\"\",IF($F4=\"1F\",INDEX([2]Tabelas!$Q$4:$R$5,MATCH($G4,[2]Tabelas!$L$4:$L$5,1),MATCH($J4,[2]Tabelas!$Q$3:$R$3,0)),INDEX([2]Tabelas!$Q$6:$R$9,MATCH($G4,[2]Tabelas!$N$6:$N$9,1),MATCH($J4,[2]Tabelas!$Q$3:$R$3,0))))","v":""},"XLPE"]
["Faixa:",{"$f":"IF($B$4>=[2]Tabelas!$A$5,INDEX([2]Tabelas!$A$5:$A$14,COUNTA([2]Tabelas!$A$5:$A$14)-COUNTIF([2]Tabelas!$A$5:$A$14,\">\"&$B$4),) & \" < De ≤ \" & INDEX([2]Tabelas!$B$5:$B$14,COUNTA([2]Tabelas!$A$5:$A$14)-COUNTIF([2]Tabelas!$A$5:$A$14,\">\"&$B$4),),[2]Tabelas!$A$5 & \" < De ≤ \" & [2]Tabelas!$B$5)","v":{"$error":"#REF!"}},null,null,"Tipo 1",null,null,{"$f":"IF($G5=0,0,IF($F5=\"1F\",INDEX([2]Tabelas!$P$4:$P$5,MATCH($G5,[2]Tabelas!$L$4:$L$5,1),),INDEX([2]Tabelas!$P$6:$P$9,MATCH($G5,[2]Tabelas!$N$6:$N$9,1),)))","v":0},{"$f":"IF($G5=0,\"\",IF($F5=\"1F\",INDEX([2]Tabelas!$Q$4:$R$5,MATCH($G5,[2]Tabelas!$L$4:$L$5,1),MATCH($J5,[2]Tabelas!$Q$3:$R$3,0)),INDEX([2]Tabelas!$Q$6:$R$9,MATCH($G5,[2]Tabelas!$N$6:$N$9,1),MATCH($J5,[2]Tabelas!$Q$3:$R$3,0))))","v":""},"XLPE"]
["Qtd Circuitos:",{"$f":"INDEX([2]Tabelas!$C$5:$C$14,MATCH($B$4,[2]Tabelas!$A$5:$A$14,1),)","v":{"$error":"#REF!"}},{"$f":"IF(B6=1,\"Circuito\",\"Circuitos\")","v":{"$error":"#REF!"}},null,"Tipo 2",null,null,{"$f":"IF($G6=0,0,IF($F6=\"1F\",INDEX([2]Tabelas!$P$4:$P$5,MATCH($G6,[2]Tabelas!$L$4:$L$5,1),),INDEX([2]Tabelas!$P$6:$P$9,MATCH($G6,[2]Tabelas!$N$6:$N$9,1),)))","v":0},{"$f":"IF($G6=0,\"\",IF($F6=\"1F\",INDEX([2]Tabelas!$Q$4:$R$5,MATCH($G6,[2]Tabelas!$L$4:$L$5,1),MATCH($J6,[2]Tabelas!$Q$3:$R$3,0)),INDEX([2]Tabelas!$Q$6:$R$9,MATCH($G6,[2]Tabelas!$N$6:$N$9,1),MATCH($J6,[2]Tabelas!$Q$3:$R$3,0))))","v":""},"XLPE"]
{"$rows_left_out":65}
{"sheet":"PAGE11.1","index":20,"n_rows":77,"n_cols":38,"rows_kept":77,"cut":false,"hidden":true,"merged":[[16,7,16,8],[16,10,16,12],[16,14,16,16],[16,18,16,19],[17,7,17,8],[17,18,17,19],[14,0,14,1],[14,2,14,3],[14,4,14,5],[15,0,15,1],[15,2,15,3],[15,4,15,5],[1,15,2,15],[1,16,1,17],[1,20,1,21],[1,29,2,30],[3,31,4,31],[1,31,2,31],[1,32,1,37],[2,25,10,25],[2,32,2,37],[3,29,4,29],[3,30,4,30],[5,29,11,29],[3,32,4,32],[3,33,3,34],[3,35,4,35],[3,36,3,37],[0,0,0,8],[0,10,0,17],[0,19,0,22],[0,24,0,27],[0,29,0,37],[1,0,2,1],[1,2,1,8],[1,10,2,10],[1,11,1,12],[1,13,1,14],[2,2,3,2],[2,3,3,3],[2,4,3,4],[2,5,3,5],[2,6,3,6],[2,7,2,8]]}
["DIMENSIONAMENTO ENTRADA DE SERVIÇO_ANEXO II - Tabela 02 (DIS-NOR-053)",null,null,null,null,null,null,null,null,null,"DIMENSIONAMENTO DAS ENTRADAS INDIVIDUAIS _ANEXO II - Tabela 03 (DIS-NOR-053)",null,null,null,null,null,null,null,null,"BARRAMENTO COBRE _ ANEXO II - Tabela 04 (DIS-NOR-053)",null,null,null,null,"ATENDIMENTO AÉREO _ ANEXO II - Tabela 06 (DIS-NOR-053)",null,null,null,null,"CONDUTOR DE BT_ANEXO I - Tabela 14 (DIS-NOR-036)"]
["Demanda Máxima da Edificação (kVA)",null,"Ramal de Entrada de Subterrâneo",null,null,null,null,null,null,null,"CAT","CARGA INSTALADA",null,"DEMANDA",null,"DISJUNTOR","CABO",null,null,"Demanda","Dimensões",null,"Corrente",null,"Demanda","Tensão","Ramal de Ligação XLPE","Poste DT",null,"Transformador",null,"Proteção","Condutores de BT"]
[null,null,"Quantidade Circuitos","Seção (mm²) XLPE","Duto PEAD","Duto\nAço","Corrente Total (A)","Disjuntor Geral",null,null,null,"De","Até","De","Até",null,"PVC","XLPE",null,"(kVA)","(mm)","(pol)","(A)",null,135,"380/220","AL 3x70(70)",200,null,null,null,null,"Em eletroduto rígido"]
["Mín","Máx",null,null,null,null,null,"Carcaça","Corrente",null,"M2",0,8,null,null,40,10,6,null,0,"19 x 3",null,208,null,115,null,"AL 3x70(70)",200,null,"Tensão secundária (V)","Potência nominal","Disjuntor (A)","Isolação PVC 70º C (mm²)","Eletroduto diâmetro nominal (mm)",null,"Isolação EPR/XLPE 90º C (mm²)","Eletroduto diâmetro nominal (mm)"]
[0,{"$f":"A6-1","v":46},1,25,110,100,85,"D100",63,null,"M3",8.1,15,null,null,63,25,16,null,41,"25 x 3",null,250,null,98,null,"AL 3x50(50)",200,null,null,null,null,null,"PVC","AÇO",null,"PVC","AÇO"]
[47,{"$f":"A7-1","v":54},1,35,110,100,103,"D100",80,null,"T5",null,null,0,32,50,25,16,null,75,"25 x 5",null,340,null,75,null,"AL 3x35(35)",200,null,"380/220",30,50,"3x10(10)",32,25,"3x10(10)",32,25]
{"$rows_left_out":72}
{"sheet":"BASE TRAFO","index":21,"n_rows":8,"n_cols":1,"rows_kept":8,"cut":false,"hidden":true,"merged":[]}
["TRAFOS"]
[30]
[45]
[75]
[112.5]
[150]
{"$rows_left_out":2}