{"text_format":"1","workbook":"xlsx","n_sheets":22,"sheets":["PAGE0","PAGE0.1","PAGE1","PAGE2","PAGE3","PAGE4","PAGE5","PAGE6","PAGE7","PAGE9","PAGE10","Planilha1","PAGE1.1","PAGE2.1","PAGE3.1","PAGE 4.2","PAGE4.1","PAGE9.1","PAGE10.1","PAGE8","PAGE11.1","BASE TRAFO"],"not_rendered":{"charts":0,"images":29,"macros":1,"external_links":2,"defined_names":19,"comments":1,"pivot_tables":0},"unopened":[],"bounds":{"document_bytes":16777216,"sheet_cells":100000,"rows_first":2000,"rows_last":500,"rows_between":2000,"halvings":0,"cell_chars":16384,"cell_head_chars":4096},"cells_cut":0,"cells_raw":0,"read":"whole","date_system":"1900"}

{"sheet":"PAGE0","index":0,"n_rows":21,"n_cols":12,"rows_kept":21,"cut":false,"hidden":false,"merged":[[19,2,20,5],[20,11,20,12],[2,2,2,10],[5,8,5,10],[6,8,6,10],[8,6,9,11],[7,6,7,11],[14,6,15,11],[13,6,13,11]]}
[]
[]
[]
[]
[]
[]
[]
[null,null,null,null,null,null,"Aplicação:"]
[null,null,null,null,null,null,"SUBESTAÇÕES AÉREAS UNITÁRIAS COM \nATÉ 300kVA DE POTÊNCIA "]
[]
[]
[]
[]
[null,null,null,null,null,null,"Aplicação:"]
[null,null,null,null,null,null,"MÚLTIPLAS UNIDADES CONSUMIDORAS COM DEMANDA ATÉ 50 kVA"]
[]
[]
[]
[]
[null,null,"Obs.: Necessário permitir execução de macros \npara possibilitar algumas funções automáticas."]
[null,null,null,null,null,null,null,null,null,null,null,"Versão 1.3"]

{"sheet":"PAGE0.1","index":1,"n_rows":22,"n_cols":12,"rows_kept":22,"cut":false,"hidden":false,"merged":[[20,3,20,10],[19,3,19,10],[21,11,21,12],[2,2,2,10],[5,3,5,10],[6,3,6,6],[6,7,6,10],[7,3,11,6],[7,7,11,10],[13,3,13,10],[21,5,21,8],[18,3,18,4],[16,5,16,10],[18,5,18,10],[17,3,17,4],[17,5,17,10],[14,3,15,10],[16,3,16,4]]}
[]
[]
[]
[]
[]
[null,null,null,"Texto para ser inserido no campo 5 da ART/TRT"]
[null,null,null,"Grupo A",null,null,null,"MUC"]
[null,null,null,"PROJETO DE SUBESTAÇÃO AÉREA COM TRANSFORMADOR DE XXX kVA, COM MONTAGEM ATENDENDO AOS REQUISITOS DA NORMA DIS-NOR-036 DO GRUPO NEOENERGIA, COM POTÊNCIA A SER CONTRATADA DE YYY kW.",null,null,null,"PROJETO DE MEDIÇÃO COLETIVA PARA XXX UNIDADES CONSUMIDORAS, CUJA DEMANDA TOTAL DO AGRUPAMENTO É DE YYY kVA, COM MONTAGEM DOS QUADROS ATENDENDO AOS REQUISITOS DA NORMA DIS-NOR-053 DO GRUPO NEOENERGIA."]
[]
[]
[]
[]
[]
[null,null,null,"Informações adicionais"]
[null,null,null,"Enviar relatório extraído (em formato PDF), juntamente com a respectiva \nART/TRT solicitanto a abertura de nota para os canais correspondentes abaixo:"]
[]
[null,null,null,"Grupo A (e-mail):",null,"clientescorporativos.pe@neoenergia.com"]
[null,null,null,"Grupo A (portal):",null,"http://clientescorporativos.celpe.com.br "]
[null,null,null,"MUC: ",null,"projetos.pe@neoenergia.com"]
[null,null,null,"Em caso de dúvidas consultar:"]
[null,null,null,"analise.projetospe@neoenergia.com"]
[null,null,null,null,null,"Para copiar texto, click no ícone:",null,null,null,null,null,"Versão 1.3"]

{"sheet":"PAGE1","index":2,"n_rows":35,"n_cols":15,"rows_kept":35,"cut":false,"hidden":false,"merged":[[23,4,23,6],[23,8,23,9],[23,10,23,13],[17,3,17,7],[19,3,19,4],[19,5,19,11],[21,4,21,6],[21,9,21,13],[17,9,17,10],[17,12,17,13],[31,3,31,8],[31,9,31,11],[34,14,34,15],[25,3,25,13],[27,3,27,11],[29,3,29,11],[29,12,29,13],[2,3,2,12],[4,3,4,13],[6,3,6,5],[6,6,6,8],[8,3,8,7],[8,9,8,13],[15,3,15,7],[12,9,12,12],[9,9,9,12],[9,3,9,7],[11,3,11,7],[11,9,11,13],[12,3,12,7],[14,3,14,7],[14,9,14,13],[15,9,15,12]]}
[]
[]
[]
[]
[null,null,null,"1 - Dados da Obra"]
[]
[null,null,null,"1.1 - Número da  ART/TRT:"]
[]
[null,null,null,"1.2 - Solicitante:",null,null,null,null,null,"1.3 - CPF/CNPJ"]
[]
[]
[null,null,null,"1.4 - E-mail Solicitante:",null,null,null,null,null,"1.5 - Telefone Solicitante"]
[]
[]
[null,null,null,"1.6 - E-mail Projetista:",null,null,null,null,null,"1.7 - Telefone Projetista:"]
[]
[]
[null,null,null,"1.8 - Endereço da obra (conforme ART):",null,null,null,null,"Lat:",null,null," Long:"]
[]
[null,null,null,"Logradouro:",null,null,null,null,null,null,null,null,"Nº"]
[]
[null,null,null,"CEP:",null,null,null,null,"Bairro:"]
[]
[null,null,null,"Cidade:",null,null,null,null,"Comp. / Ref.:"]
[]
[null,null,null,"2 - Referência Elétrica"]
[]
[null,null,null,"2.1 - Informe a distância do Ponto Conexão (PDE) até o limite da propriedade:",null,null,null,null,null,null,null,null,null,"Metros"]
[]
[null,null,null,"2.2 - Informe o número da plaqueta que existe no poste da NEOENERGIA mais próximo: "]
[]
[null,null,null,"2.3 - Ou, número do medidor de energia mais próximo:"]
[]
[]
[null,null,null,null,null,null,null,null,null,null,null,null,null,null,"Versão 1.3"]

{"sheet":"PAGE2","index":3,"n_rows":37,"n_cols":15,"rows_kept":37,"cut":false,"hidden":false,"merged":[[11,3,11,5],[11,6,11,7],[11,8,11,9],[11,10,11,11],[11,12,11,13],[31,3,32,10],[31,11,32,11],[31,13,34,15],[36,14,36,15],[19,3,19,13],[20,3,20,13],[23,3,23,13],[25,3,26,5],[25,6,26,6],[25,7,25,8],[25,9,26,13],[22,6,22,7],[22,8,22,9],[22,10,22,11],[22,12,22,13],[22,4,22,5],[28,3,29,10],[28,11,29,11],[16,3,16,5],[16,6,16,7],[16,8,16,9],[16,10,16,11],[16,12,16,13],[17,3,17,5],[17,6,17,7],[17,8,17,9],[17,10,17,11],[17,12,17,13],[14,3,14,5],[14,6,14,7],[14,8,14,9],[14,10,14,11],[14,12,14,13],[15,3,15,5],[15,6,15,7],[15,8,15,9],[15,10,15,11],[15,12,15,13],[12,3,12,5],[12,6,12,7],[12,8,12,9],[12,10,12,11],[12,12,12,13],[13,3,13,5],[13,6,13,7],[13,8,13,9],[13,10,13,11],[13,12,13,13],[10,6,10,7],[10,3,10,5],[2,3,2,12],[4,3,4,13],[8,3,8,7],[10,12,10,13],[10,10,10,11],[10,8,10,9],[6,3,6,7],[6,10,6,11],[7,10,7,11],[6,12,6,13],[7,12,7,13],[8,10,8,11]]}
[]
[]
[]
[]
[null,null,null,"3 - Quadros de Distribuição (QD)"]
[]
[null,null,null,"3.1 - Quantidade de unidades consumidoras:",null,null,null,null,null,null,"Carga Existente:",null,{"$f":"CONCATENATE(SUM(SUMIF(PAGE5!D10:D33,\"Existente\",PAGE5!J10:J33), SUMIF(PAGE6!D10:D33,\"Existente\",PAGE6!J10:J33), SUMIF(PAGE7!D10:D34,\"Existente\",PAGE7!J10:J34),SUMIF(PAGE8!D10:D33,\"Existente\",PAGE8!J10:J33)), \" kW\")","v":"0 kW"}]
[null,null,null,null,null,null,null,null,null,null,"Carga à instalar:",null,{"$f":"CONCATENATE(SUM(SUMIF(PAGE5!D10:D33,\"Novo\",PAGE5!J10:J33), SUMIF(PAGE6!D10:D33,\"Novo\",PAGE6!J10:J33), SUMIF(PAGE7!D10:D34,\"Novo\",PAGE7!J10:J34),SUMIF(PAGE8!D10:D33,\"Novo\",PAGE8!J10:J33)), \" kW\")","v":"0 kW"}]
[null,null,null,"3.2 - Dados do(s) Quadro(s) de Distribuição (QD's):"]
[]
[null,null,null,"Dados dos Quadros",null,null,"QDG**",null,"QD - Parcial 1",null,"QD - Parcial 2",null,"QD - Parcial 3"]
[null,null,null,"Material"]
[null,null,null,"Demanda Total (kVA)*",null,null,{"$f":"PAGE8!B17","v":0}]
[null,null,null,"Barramento de Cobre",null,null,{"$f":"IF(G13<=0, \"\", IF(G13<=40,\"19 x 3 mm\",IF(AND(G13>40,G13<=50),\"25 x 3 mm\",\"Demanda inválida\")))","v":""},null,"N/A",null,"N/A",null,"N/A"]
[null,null,null,"Disjuntor Geral (A)",null,null,{"$f":"IF(G13<=0, \"\",IF(AND(G13>0,G13<=50), \"80A\",\"Demanda inválida\"))","v":""},null,"N/A",null,"N/A",null,"N/A"]
[null,null,null,"Cabo do Ramal de Entrada (mm²)",null,null,{"$f":"IF(G13<=0, \"\",IF(AND(G13>0,G13<=50), \"16mm² XLPE OU 25mm² PVC\",\"Demanda inválida\"))","v":""},null,"N/A",null,"N/A",null,"N/A"]
[null,null,null,"Diâmetro do Eletroduto",null,null,{"$f":"IF(G13<=0, \"\",IF(AND(G13>0,G13<=50), \"1.1/4\", \"Demanda inválida\"))","v":""},null,"N/A",null,"N/A",null,"N/A"]
[null,null,null,"Ramal de Ligação Neoenergia",null,null,{"$f":"IF(G13<=0, \"\",IF(AND(G13>0,G13<=50),\"3x25 + 1x25 mm²\", \"Demanda inválida\"))","v":""},null,"N/A",null,"N/A",null,"N/A"]
[]
[null,null,null,"* Preencher apenas com o número da demanda (não usar letras), pode conter vírgula. O Valor deve ser igual ao declarado na ART (consultar informações tela inicial). "]
[null,null,null,"** O valor da demanda calculada deve ser conforme metodologia do Anexo I  da DIS-NOR-053 e a Categoria de Agrupamento conforme Tabela 5 do Anexo II. O ramal de conexão deve ser do tipo aéreo e a edificação deve apresentar apenas um centro de medição, seguindo as limitações de caixas de medição por barramento de cada modelo. Cada consumidor deverá ser cadastrado no seu respectivo quadro em que ficará acoplado o medidor."]
[null,null,null,null,null,null,{"$f":"IF(G13<=0,\"0\",IF(AND(G13>0,PAGE5!P35=5),\"1\",IF(AND(G13>0,PAGE5!P35=6),\"2\",IF(AND(G13>0,PAGE5!P35=7),\"3\",\"0\"))))","v":"0"},{"$f":"G22+1","v":1},{"$f":"IF(I13<=0,\"0\",IF(AND(I13>0,PAGE6!P35=5),\"1\",IF(AND(I13>0,PAGE6!P35=6),\"2\",IF(AND(I13>0,PAGE6!P35=7),\"3\",\"0\"))))","v":"0"},{"$f":"I22+1","v":1},{"$f":"G13","v":0},null,{"$f":"IF(M13<=0,\"0\",IF(AND(M13>0,PAGE8!P35=5),\"1\",IF(AND(M13>0,PAGE8!P35=6),\"2\",IF(AND(M13>0,PAGE8!P35=7),\"3\",\"0\"))))","v":"0"},{"$f":"K22","v":0}]
[null,null,null,null,"Cadastrar Consumidores:",null,null,null,null,null,"Cálculo de Demanda Total:"]
[null,null,null,"3.3 - Localização da instalação do QDG:"]
[]
[null,null,null,"O QDG está instalado com acesso livre para a via pública?",null,null,null,"Justifique:"]
[]
[]
[null,null,null,"Caso esteja dentro da edificação, o QDG está instalado\n limitando-se o comprimento do condutor em 40m do ponto de conexão?"]
[]
[]
[null,null,null,"Os locais de instalação dos medidores possuem identificação das unidades com placa 40x20mm em metal ou acrílico com texto em baixo ou alto relevo?"]
[]
[]
[]
[]
[null,null,null,null,null,null,null,null,null,null,null,null,null,null,"Versão 1.3"]

{"sheet":"PAGE3","index":4,"n_rows":34,"n_cols":15,"rows_kept":34,"cut":false,"hidden":false,"merged":[[29,3,30,7],[25,3,25,7],[26,3,28,6],[26,7,28,7],[21,7,22,7],[21,3,22,6],[21,8,24,15],[17,8,18,12],[10,3,10,11],[12,3,12,7],[13,3,14,5],[13,6,14,6],[13,8,14,12],[6,3,6,7],[33,14,33,15],[2,3,2,12],[4,3,4,13],[7,13,8,13],[7,3,8,12],[17,13,18,13],[19,8,19,13],[20,3,20,7],[13,13,14,13],[9,3,9,11],[28,13,31,15],[15,8,15,13],[16,3,16,7],[17,3,18,5],[17,6,18,6]]}
[]
[]
[]
[]
[null,null,null,"4 - Informações da instalação"]
[]
[null,null,null,"4.1 - Aterramento"]
[null,null,null,"Todos os quadros estão aterrados e conectados através de poços de inspeção, conforme desenho 36 do Anexo III da norma DIS-NOR-053, em malha de terra formada por no mínimo 3 hastes?"]
[]
[null,null,null,"É essencial seguir o padrão de aterramento de acordo com a norma para possibilitar a interligação."]
[null,null,null,"Cabo para interligar a malha de  aterramento: 35mm² de cobre nú ou 2AWG de aço cobreado."]
[]
[null,null,null,"4.2 - Caixas de Passagens"]
[null,null,null,"Possui Caixa de passagem do ramal de entrada?",null,null,null,null,"As caixas de passagens serão instaladas conforme o desenho 69 do Anexo III da norma DIS-NOR-053?"]
[]
[null,null,null,null,null,null,null,null,"É essencial seguir o padrão da  norma para possibilitar a interligação."]
[null,null,null,"4.3 - Bomba de Incêndio"]
[null,null,null,"É previsto bomba de incêndio para a edificação?",null,null,null,null,"A bomba de incêndio será instalada conforme item 6.20.1 da norma DIS-NOR-053?"]
[]
[null,null,null,null,null,null,null,null,"É essencial seguir o padrão da  norma para possibilitar a interligação."]
[null,null,null,"4.4 - Condutores"]
[null,null,null,"Os condutores \nsão semi-rígidos (classe 2)?",null,null,null,null,"DIS-NOR-053 - Item 6.17.41: No caso da interligação seja executada com condutores com classe de encordoamento 5 (flexível), devem obrigatoriamente ter suas extremidades conectadas utilizando terminais maciços de compressão tipo curto aplicados com ferramenta apropriada e conforme recomendada pelo fabricante.\n\n"]
[]
[]
[]
[null,null,null,"4.5 - Terminais"]
[null,null,null,"Os terminais usados para conectar os condutores aos barramentos são de pressão (ver imagem)?"]
[]
[]
[null,null,null,"É essencial seguir o padrão da norma para possibilitar a interligação."]
[]
[]
[]
[null,null,null,null,null,null,null,null,null,null,null,null,null,null,"Versão 1.3"]

{"sheet":"PAGE4","index":5,"n_rows":22,"n_cols":14,"rows_kept":22,"cut":false,"hidden":false,"merged":[[21,13,21,14],[2,3,2,12],[5,9,5,12],[6,9,6,12],[6,3,6,6],[7,3,17,6]]}
[]
[null,null,{"$f":"IF(PAGE9!F7 = 43, \"1\", \"0\")","v":"0"}]
[]
[]
[]
[]
[null,null,null,"Anotações / Informações adicionais."]
[]
[]
[]
[]
[]
[]
[]
[]
[]
[]
[]
[null,null,null,"Limite de 1000 caracteres."]
[]
[]
[null,null,null,null,null,null,null,null,null,null,null,null,null,"Versão 1.3"]

{"sheet":"PAGE5","index":6,"n_rows":37,"n_cols":16,"rows_kept":37,"cut":false,"hidden":false,"merged":[[35,10,35,11],[34,10,34,11],[33,2,35,9],[6,7,6,12]]}
[]
[]
[]
[]
[]
[]
[null,null,null,null,null,null,null,"Esse QDG não possui consumidores, pois funcionará como QPGS."]
[]
[null,null,"Item","Tipo","Tipo de Ligação","Unidade Consumidora","N° Identif. (Ex.: 1A)","Pavimento","Área (m²)","Carga Insta-\nlada (kW)","Demanda \n(kVA)","Disjuntor de Proteção (A)","Ramal de Distribuição (mm²)","Diâmetro do Eletroduto (mm²)","Status"]
[null,null,1,null,null,null,null,null,null,null,null,{"$f":"IF(OR(ISBLANK(D10),ISBLANK(E10),ISBLANK(F10),ISBLANK(G10),ISBLANK(H10),ISBLANK(I10),ISBLANK(J10),ISBLANK(K10)),\"\",IF(E10=\"Monofásico\",IF(AND(J10>0,J10<=10),\"40\",IF(AND(J10>10,J10<=15),\"63\",\"\")),IF(E10=\"Trifásico\",IF(ISBLANK(K10),\"Inserir Demanda\",IF(AND(K10>0,K10<=21),\"32\",IF(AND(K10>21,K10<=26),\"40\",IF(AND(K10>26,K10<=33),\"50\",\"Demanda deve ser 0-33 KVA\")))),\"Falha, consultar Adminitrador\")))","v":""},{"$f":"IF(OR(ISBLANK(D10), ISBLANK(E10), ISBLANK(F10),ISBLANK(G10),ISBLANK(H10),ISBLANK(I10), ISBLANK(J10),ISBLANK(K10)), \"\", IF(E10= \"Monofásico\", IF(AND(J10>0, J10<=10), \"CU-6(6)-XLPE/HEPR ou CU-10(10)-PVC\", IF(AND(J10>10, J10<=15), \"CU-16(16)-XLPE/EPR ou CU-16(16)-PVC\", \"\")),  IF(E10= \"Trifásico\", IF(ISBLANK(K10), \"Inserir Demanda\", IF(AND(K10>0, K10<=21), \"CU-3#6(6)-XLPE/HEPR ou CU-3#6(6)-PVC \", IF(AND(K10>21,K10<=26), \"CU-3#6(6)-XLPE/HEPR ou CU-3#10(10)-PVC \", IF(AND(K10>26,K10<=33), \"CU-3#10(10)-XLPE/HEPR ou CU-3#16(16)-PVC \", \"Demanda deve ser 0-33 KVA\")))),\"Falha, consultar Adminitrador\")))","v":""},{"$f":"IF(OR(ISBLANK(D10),ISBLANK(E10),ISBLANK(F10),ISBLANK(G10),ISBLANK(H10),ISBLANK(I10),ISBLANK(J10),ISBLANK(K10)),\"\",IF(E10=\"Monofásico\",IF(AND(J10>0,J10<=10),\"1.1/4 pol.\",IF(AND(J10>10,J10<=15),\"1.1/4 pol.\",\"\")),IF(E10=\"Trifásico\",IF(ISBLANK(K10),\"Inserir Demanda\",IF(AND(K10>0,K10<=21),\"1.1/4 pol.\",IF(AND(K10>21,K10<=26),\"1.1/4 pol.\",IF(AND(K10>26,K10<=33),\"1.1/4 pol.\",\"Demanda deve ser 0-33 KVA\")))),\"Falha, consultar Adminitrador\")))","v":""},{"$f":"P10+1","v":1},{"$f":"IF(AND(ISBLANK(E10),ISBLANK(D10), ISBLANK(I10), ISBLANK(F10), ISBLANK(J10)), \"0\", IF(OR(ISBLANK(E10), ISBLANK(F10), ISBLANK(J10),L10=\"\"), \"1\", IF(AND(E10= \"Trifásico\", OR(ISBLANK(F10), ISBLANK(J10), ISBLANK(K10))), \"1\", \"2\")))","v":"0"}]
[null,null,2,null,null,null,null,null,null,null,null,{"$f":"IF(OR(ISBLANK(D11),ISBLANK(E11),ISBLANK(F11),ISBLANK(G11),ISBLANK(H11),ISBLANK(I11),ISBLANK(J11),ISBLANK(K11)),\"\",IF(E11=\"Monofásico\",IF(AND(J11>0,J11<=10),\"40\",IF(AND(J11>10,J11<=15),\"63\",\"\")),IF(E11=\"Trifásico\",IF(ISBLANK(K11),\"Inserir Demanda\",IF(AND(K11>0,K11<=21),\"32\",IF(AND(K11>21,K11<=26),\"40\",IF(AND(K11>26,K11<=33),\"50\",\"Demanda deve ser 0-33 KVA\")))),\"Falha, consultar Adminitrador\")))","v":""},{"$f":"IF(OR(ISBLANK(D11), ISBLANK(E11), ISBLANK(F11),ISBLANK(G11),ISBLANK(H11),ISBLANK(I11), ISBLANK(J11),ISBLANK(K11)), \"\", IF(E11= \"Monofásico\", IF(AND(J11>0, J11<=10), \"CU-6(6)-XLPE/HEPR ou CU-10(10)-PVC\", IF(AND(J11>10, J11<=15), \"CU-16(16)-XLPE/EPR ou CU-16(16)-PVC\", \"\")),  IF(E11= \"Trifásico\", IF(ISBLANK(K11), \"Inserir Demanda\", IF(AND(K11>0, K11<=21), \"CU-3#6(6)-XLPE/HEPR ou CU-3#6(6)-PVC \", IF(AND(K11>21,K11<=26), \"CU-3#6(6)-XLPE/HEPR ou CU-3#10(10)-PVC \", IF(AND(K11>26,K11<=33), \"CU-3#10(10)-XLPE/HEPR ou CU-3#16(16)-PVC \", \"Demanda deve ser 0-33 KVA\")))),\"Falha, consultar Adminitrador\")))","v":""},{"$f":"IF(OR(ISBLANK(D11),ISBLANK(E11),ISBLANK(F11),ISBLANK(G11),ISBLANK(H11),ISBLANK(I11),ISBLANK(J11),ISBLANK(K11)),\"\",IF(E11=\"Monofásico\",IF(AND(J11>0,J11<=10),\"1.1/4 pol.\",IF(AND(J11>10,J11<=15),\"1.1/4 pol.\",\"\")),IF(E11=\"Trifásico\",IF(ISBLANK(K11),\"Inserir Demanda\",IF(AND(K11>0,K11<=21),\"1.1/4 pol.\",IF(AND(K11>21,K11<=26),\"1.1/4 pol.\",IF(AND(K11>26,K11<=33),\"1.1/4 pol.\",\"Demanda deve ser 0-33 KVA\")))),\"Falha, consultar Adminitrador\")))","v":""},{"$f":"P11+1","v":1},{"$f":"IF(AND(ISBLANK(E11),ISBLANK(D11), ISBLANK(I11), ISBLANK(F11), ISBLANK(J11)), \"0\", IF(OR(ISBLANK(E11), ISBLANK(F11), ISBLANK(J11),L11=\"\"), \"1\", IF(AND(E11= \"Trifásico\", OR(ISBLANK(F11), ISBLANK(J11), ISBLANK(K11))), \"1\", \"2\")))","v":"0"}]
[null,null,3,null,null,null,null,null,null,null,null,"","","",1,"0"]
[null,null,4,null,null,null,null,null,null,null,null,"","","",1,"0"]
[null,null,5,null,null,null,null,null,null,null,null,"","","",1,"0"]
[null,null,6,null,null,null,null,null,null,null,null,"","","",1,"0"]
[null,null,7,null,null,null,null,null,null,null,null,"","","",1,"0"]
[null,null,8,null,null,null,null,null,null,null,null,"","","",1,"0"]
[null,null,9,null,null,null,null,null,null,null,null,"","","",1,"0"]
[null,null,10,null,null,null,null,null,null,null,null,"","","",1,"0"]
[null,null,11,null,null,null,null,null,null,null,null,"","","",1,"0"]
[null,null,12,null,null,null,null,null,null,null,null,"","","",1,"0"]
[null,null,13,null,null,null,null,null,null,null,null,"","","",1,"0"]
[null,null,14,null,null,null,null,null,null,null,null,"","","",1,"0"]
[null,null,15,null,null,null,null,null,null,null,null,"","","",1,"0"]
[null,null,16,null,null,null,null,null,null,null,null,"","","",1,"0"]
[null,null,17,null,null,null,null,null,null,null,null,"","","",1,"0"]
[null,null,18,null,null,null,null,null,null,null,null,"","","",1,"0"]
[null,null,19,null,null,null,null,null,null,null,null,"","","",1,"0"]
[null,null,20,null,null,null,null,null,null,null,null,"","","",1,"0"]
[null,null,21,null,null,null,null,null,null,null,null,"","","",1,"0"]
[null,null,22,null,null,null,null,null,null,null,null,"","","",1,"0"]
[null,null,23,null,null,null,null,null,null,null,null,"","","",1,"0"]
[null,null,24,null,null,null,null,null,null,null,null,"","","",1,"0"]
[null,null,{"$f":"IF(ISBLANK(PAGE2!G12),\"ATENÇÃO: PREENCHER MATERIAL DO QUADRO NA PAGINA ANTERIOR.\",IF(PAGE2!G12=\"POLICARBONATO\",\"\",IF(PAGE2!G12=\"METALICO\",IF(AND(COUNTIF(E10:E33,\"Trifásico\")<1,COUNTIF(PAGE5!E10:E33,\"Monofásico\")<=19),\"\",IF(AND(COUNTIF(E10:E33,\"Trifásico\")=1,COUNTIF(PAGE5!E10:E33,\"Monofásico\")<=18),\"\",IF(AND(COUNTIF(E10:E33,\"Trifásico\")>1,COUNTBLANK(E10:E33)>=11),\"\",\"ATENÇÃO: QUADRO MODELO METÁLICO, EXCEDIDA A CAPACIDADE DE MEDIDORES PERMITIDOS. VERIFICAR NORMA DIS-NOR-053 ONDE INFORMA A DISPOSIÇÃO DOS MEDIDORES NOS TIPOS DE QUADROS.\"))))))","v":"ATENÇÃO: PREENCHER MATERIAL DO QUADRO NA PAGINA ANTERIOR."},null,null,null,null,null,null,null,null,null,null,null,5,{"$f":"IF(PAGE10!A1=TRUE, \"2\", IF(OR(B37= \"1\", P10= \"1\",P11= \"1\",P12= \"1\",P13= \"1\",P14= \"1\",P15= \"1\",P16= \"1\",P17= \"1\",P18= \"1\",P19= \"1\",P20= \"1\",P21= \"1\",P22= \"1\",P23= \"1\",P24= \"1\",P25= \"1\",P26= \"1\",P27= \"1\",P28= \"1\",P29= \"1\",P30= \"1\",P31= \"1\",P32= \"1\",P33= \"1\"), \"1\", IF(AND(P10= \"0\", P11= \"0\",P12= \"0\",P13= \"0\",P14= \"0\",P15= \"0\",P16= \"0\",P17= \"0\",P18= \"0\",P19= \"0\",P20= \"0\",P21= \"0\",P22= \"0\",P23= \"0\",P24= \"0\",P25= \"0\",P26= \"0\",P27= \"0\",P28= \"0\",P29= \"0\",P30= \"0\",P31= \"0\",P32= \"0\",P33= \"0\"),\"0\",\"2\")))","v":"1"}]
[null,null,null,null,null,null,null,null,null,null,"Situação do documento:   ",null,"Falha ao Gerar Formulário",null,null,{"$f":"P34+O34","v":6}]
[null,null,null,null,null,null,null,null,null,null,"Situação do documento:   ",null,"Formulário Preenchido com sucesso"]
[null,{"$f":"IF(C34=\"\",\"2\",\"1\")","v":"1"}]

{"sheet":"PAGE6","index":7,"n_rows":37,"n_cols":16,"rows_kept":37,"cut":false,"hidden":false,"merged":[[34,10,34,11],[35,10,35,11],[33,2,35,9]]}
[]
[]
[]
[]
[]
[]
[]
[]
[null,null,"Item","Tipo","Tipo de Ligação","Unidade Consumidora","N° Identif. \n(Ex.: 1A)","Pavimento","Área (m²)","Carga Insta-\nlada (kW)","Demanda \n(kVA)","Disjuntor de Proteção (A)","Ramal de Distribuição (mm²)","Diâmetro do Eletroduto (mm²)","Status"]
[null,null,1,null,null,null,null,null,null,null,null,{"$f":"IF(OR(ISBLANK(D10),ISBLANK(E10),ISBLANK(F10),ISBLANK(G10), ISBLANK(H10),  ISBLANK(I10), ISBLANK(J10), ISBLANK(K10)), \"\", IF(E10= \"Monofásico\", IF(AND(J10>0, J10<=3), \"15 ou 16\", IF(AND(J10>3, J10<=8), \"40\", IF(AND(J10>8, J10<=10), \"50\", IF(AND(J10>10, J10<=15), \"70\", \"\")))),  IF(E10= \"Trifásico\", IF(ISBLANK(K10), \"Inserir Demanda\", IF(AND(K10>0, K10<=25), \"40\",  IF(AND(K10>25, K10<=32), \"60 ou 63\", \"Demanda deve ser 0-32 KVA\"))), \"Falha, consultar Adminitrador\")))","v":""},{"$f":"IF(OR(ISBLANK(D10), ISBLANK(E10), ISBLANK(F10),ISBLANK(G10),ISBLANK(H10),ISBLANK(I10), ISBLANK(J10),ISBLANK(K10)), \"\", IF(E10= \"Monofásico\", IF(AND(J10>0, J10<=8), \"CU-6(6)-XLPE/EPR ou CU-6(6)-PVC\", IF(AND(J10>8, J10<=10), \"CU-10(10)-XLPE/EPR ou CU-10(10)-PVC\", IF(AND(J10>10, J10<=15), \"CU-16(16)-XLPE/EPR ou CU-16(16)-PVC\", \"\"))),  IF(E10= \"Trifásico\", IF(ISBLANK(K10), \"Inserir Demanda\", IF(AND(K10>0, K10<=25), \"CU-10(10)-XLPE/EPR ou CU-10(10)-PVC \", IF(AND(K10>25, K10<=32), \"CU-16(16)-XLPE/EPR ou CU-16(16)-PVC \", \"Demanda deve ser 0-32 KVA\"))), \"Falha, consultar Adminitrador\")))","v":""},{"$f":"IF(OR(ISBLANK(D10), ISBLANK(E10),ISBLANK(F10),ISBLANK(G10), ISBLANK(H10),ISBLANK(I10), ISBLANK(J10),ISBLANK(K10)), \"\", IF(E10= \"Monofásico\", IF(AND(J10>0, J10<=8), \"25 PVC ou 25 AÇO\", IF(AND(J10>8, J10<=15), \"25 PVC ou 25 AÇO\", \"\")),  IF(E10= \"Trifásico\", IF(ISBLANK(K10), \"Inserir Demanda\", IF(AND(K10>0, K10<=32), \"40 PCV ou 32 AÇO\", \"Demanda deve ser 0-32 KVA\")), \"Falha, consultar Adminitrador\")))","v":""},{"$f":"P10+1","v":1},{"$f":"IF(AND(ISBLANK(E10),ISBLANK(D10), ISBLANK(I10), ISBLANK(F10), ISBLANK(J10)), \"0\", IF(OR(ISBLANK(E10), ISBLANK(F10), ISBLANK(J10),L10=\"\"), \"1\", IF(AND(E10= \"Trifásico\", OR(ISBLANK(F10), ISBLANK(J10), ISBLANK(K10))), \"1\", \"2\")))","v":"0"}]
[null,null,2,null,null,null,null,null,null,null,null,{"$f":"IF(OR(ISBLANK(D11),ISBLANK(E11),ISBLANK(F11),ISBLANK(G11), ISBLANK(H11),  ISBLANK(I11), ISBLANK(J11), ISBLANK(K11)), \"\", IF(E11= \"Monofásico\", IF(AND(J11>0, J11<=3), \"15 ou 16\", IF(AND(J11>3, J11<=8), \"40\", IF(AND(J11>8, J11<=10), \"50\", IF(AND(J11>10, J11<=15), \"70\", \"\")))),  IF(E11= \"Trifásico\", IF(ISBLANK(K11), \"Inserir Demanda\", IF(AND(K11>0, K11<=25), \"40\",  IF(AND(K11>25, K11<=32), \"60 ou 63\", \"Demanda deve ser 0-32 KVA\"))), \"Falha, consultar Adminitrador\")))","v":""},{"$f":"IF(OR(ISBLANK(D11), ISBLANK(E11), ISBLANK(F11),ISBLANK(G11),ISBLANK(H11),ISBLANK(I11), ISBLANK(J11),ISBLANK(K11)), \"\", IF(E11= \"Monofásico\", IF(AND(J11>0, J11<=8), \"CU-6(6)-XLPE/EPR ou CU-6(6)-PVC\", IF(AND(J11>8, J11<=10), \"CU-10(10)-XLPE/EPR ou CU-10(10)-PVC\", IF(AND(J11>10, J11<=15), \"CU-16(16)-XLPE/EPR ou CU-16(16)-PVC\", \"\"))),  IF(E11= \"Trifásico\", IF(ISBLANK(K11), \"Inserir Demanda\", IF(AND(K11>0, K11<=25), \"CU-10(10)-XLPE/EPR ou CU-10(10)-PVC \", IF(AND(K11>25, K11<=32), \"CU-16(16)-XLPE/EPR ou CU-16(16)-PVC \", \"Demanda deve ser 0-32 KVA\"))), \"Falha, consultar Adminitrador\")))","v":""},{"$f":"IF(OR(ISBLANK(D11), ISBLANK(E11),ISBLANK(F11),ISBLANK(G11), ISBLANK(H11),ISBLANK(I11), ISBLANK(J11),ISBLANK(K11)), \"\", IF(E11= \"Monofásico\", IF(AND(J11>0, J11<=8), \"25 PVC ou 25 AÇO\", IF(AND(J11>8, J11<=15), \"25 PVC ou 25 AÇO\", \"\")),  IF(E11= \"Trifásico\", IF(ISBLANK(K11), \"Inserir Demanda\", IF(AND(K11>0, K11<=32), \"40 PCV ou 32 AÇO\", \"Demanda deve ser 0-32 KVA\")), \"Falha, consultar Adminitrador\")))","v":""},{"$f":"P11+1","v":1},{"$f":"IF(AND(ISBLANK(E11),ISBLANK(D11), ISBLANK(I11), ISBLANK(F11), ISBLANK(J11)), \"0\", IF(OR(ISBLANK(E11), ISBLANK(F11), ISBLANK(J11),L11=\"\"), \"1\", IF(AND(E11= \"Trifásico\", OR(ISBLANK(F11), ISBLANK(J11), ISBLANK(K11))), \"1\", \"2\")))","v":"0"}]
[null,null,3,null,null,null,null,null,null,null,null,"","","",1,"0"]
[null,null,4,null,null,null,null,null,null,null,null,"","","",1,"0"]
[null,null,5,null,null,null,null,null,null,null,null,"","","",1,"0"]
[null,null,6,null,null,null,null,null,null,null,null,"","","",1,"0"]
[null,null,7,null,null,null,null,null,null,null,null,"","","",1,"0"]
[null,null,8,null,null,null,null,null,null,null,null,"","","",1,"0"]
[null,null,9,null,null,null,null,null,null,null,null,"","","",1,"0"]
[null,null,10,null,null,null,null,null,null,null,null,"","","",1,"0"]
[null,null,11,null,null,null,null,null,null,null,null,"","","",1,"0"]
[null,null,12,null,null,null,null,null,null,null,null,"","","",1,"0"]
[null,null,13,null,null,null,null,null,null,null,null,"","","",1,"0"]
[null,null,14,null,null,null,null,null,null,null,null,"","","",1,"0"]
[null,null,15,null,null,null,null,null,null,null,null,"","","",1,"0"]
[null,null,16,null,null,null,null,null,null,null,null,"","","",1,"0"]
[null,null,17,null,null,null,null,null,null,null,null,"","","",1,"0"]
[null,null,18,null,null,null,null,null,null,null,null,"","","",1,"0"]
[null,null,19,null,null,null,null,null,null,null,null,"","","",1,"0"]
[null,null,20,null,null,null,null,null,null,null,null,"","","",1,"0"]
[null,null,21,null,null,null,null,null,null,null,null,"","","",1,"0"]
[null,null,22,null,null,null,null,null,null,null,null,"","","",1,"0"]
[null,null,23,null,null,null,null,null,null,null,null,"","","",1,"0"]
[null,null,24,null,null,null,null,null,null,null,null,"","","",1,"0"]
[null,null,{"$f":"IF(ISBLANK(PAGE2!I12),\"ATENÇÃO: PREENCHER MATERIAL DO QUADRO NA PAGINA ANTERIOR.\",IF(PAGE2!I12=\"POLICARBONATO\",\"\",IF(PAGE2!I12=\"METALICO\",IF(AND(COUNTIF(E10:E33,\"Trifásico\")<1,COUNTIF(PAGE5!E10:E33,\"Monofásico\")<=19),\"\",IF(AND(COUNTIF(E10:E33,\"Trifásico\")=1,COUNTIF(PAGE5!E10:E33,\"Monofásico\")<=18),\"\",IF(AND(COUNTIF(E10:E33,\"Trifásico\")>1,COUNTBLANK(E10:E33)>=11),\"\",\"ATENÇÃO: QUADRO MODELO METÁLICO, EXCEDIDA A CAPACIDADE DE MEDIDORES PERMITIDOS. FAVOR VERIFICAR NORMA TAL, ONDE INFORMA A DISPOSIÇÃO DOS MEDIDORES NOS TIPOS DE QUADROS.\"))))))","v":"ATENÇÃO: PREENCHER MATERIAL DO QUADRO NA PAGINA ANTERIOR."},null,null,null,null,null,null,null,null,null,null,null,5,{"$f":"IF(OR(B37= \"1\",P10= \"1\",P11= \"1\",P12= \"1\",P13= \"1\",P14= \"1\",P15= \"1\",P16= \"1\",P17= \"1\",P18= \"1\",P19= \"1\",P20= \"1\",P21= \"1\",P22= \"1\",P23= \"1\",P24= \"1\",P25= \"1\",P26= \"1\",P27= \"1\",P28= \"1\",P29= \"1\",P30= \"1\",P31= \"1\",P32= \"1\",P33= \"1\"), \"1\", IF(AND(P10= \"0\", P11= \"0\",P12= \"0\",P13= \"0\",P14= \"0\",P15= \"0\",P16= \"0\",P17= \"0\",P18= \"0\",P19= \"0\",P20= \"0\",P21= \"0\",P22= \"0\",P23= \"0\",P24= \"0\",P25= \"0\",P26= \"0\",P27= \"0\",P28= \"0\",P29= \"0\",P30= \"0\",P31= \"0\",P32= \"0\",P33= \"0\"),\"0\",\"2\"))","v":"1"}]
[null,null,null,null,null,null,null,null,null,null,"Situação do documento:   ",null,"Falha ao Gerar Formulário",null,null,{"$f":"P34+O34","v":6}]
[null,null,null,null,null,null,null,null,null,null,"Situação do documento:   ",null,"Formulário Preenchido com sucesso"]
[null,{"$f":"IF(C34=\"\",\"2\",\"1\")","v":"1"}]

{"sheet":"PAGE7","index":8,"n_rows":37,"n_cols":16,"rows_kept":37,"cut":false,"hidden":false,"merged":[[35,10,35,11],[33,2,35,9],[34,10,34,11]]}
[]
[]
[]
[]
[]
[]
[]
[]
[null,null,"Item","Tipo","Tipo de Ligação","Unidade Consumidora","N° Identif. \n(Ex.: 1A)","Pavimento","Área (m²)","Carga Insta-\nlada (kW)","Demanda \n(kVA)","Disjuntor de Proteção (A)","Ramal de Distribuição (mm²)","Diâmetro do Eletroduto (mm²)","Status"]
[null,null,1,null,null,null,null,null,null,null,null,{"$f":"IF(OR(ISBLANK(D10),ISBLANK(E10),ISBLANK(F10),ISBLANK(G10), ISBLANK(H10),  ISBLANK(I10), ISBLANK(J10), ISBLANK(K10)), \"\", IF(E10= \"Monofásico\", IF(AND(J10>0, J10<=3), \"15 ou 16\", IF(AND(J10>3, J10<=8), \"40\", IF(AND(J10>8, J10<=10), \"50\", IF(AND(J10>10, J10<=15), \"70\", \"\")))),  IF(E10= \"Trifásico\", IF(ISBLANK(K10), \"Inserir Demanda\", IF(AND(K10>0, K10<=25), \"40\",  IF(AND(K10>25, K10<=32), \"60 ou 63\", \"Demanda deve ser 0-32 KVA\"))), \"Falha, consultar Adminitrador\")))","v":""},{"$f":"IF(OR(ISBLANK(D10), ISBLANK(E10), ISBLANK(F10),ISBLANK(G10),ISBLANK(H10),ISBLANK(I10), ISBLANK(J10),ISBLANK(K10)), \"\", IF(E10= \"Monofásico\", IF(AND(J10>0, J10<=8), \"CU-6(6)-XLPE/EPR ou CU-6(6)-PVC\", IF(AND(J10>8, J10<=10), \"CU-10(10)-XLPE/EPR ou CU-10(10)-PVC\", IF(AND(J10>10, J10<=15), \"CU-16(16)-XLPE/EPR ou CU-16(16)-PVC\", \"\"))),  IF(E10= \"Trifásico\", IF(ISBLANK(K10), \"Inserir Demanda\", IF(AND(K10>0, K10<=25), \"CU-10(10)-XLPE/EPR ou CU-10(10)-PVC \", IF(AND(K10>25, K10<=32), \"CU-16(16)-XLPE/EPR ou CU-16(16)-PVC \", \"Demanda deve ser 0-32 KVA\"))), \"Falha, consultar Adminitrador\")))","v":""},{"$f":"IF(OR(ISBLANK(D10), ISBLANK(E10),ISBLANK(F10),ISBLANK(G10), ISBLANK(H10),ISBLANK(I10), ISBLANK(J10),ISBLANK(K10)), \"\", IF(E10= \"Monofásico\", IF(AND(J10>0, J10<=8), \"25 PVC ou 25 AÇO\", IF(AND(J10>8, J10<=15), \"25 PVC ou 25 AÇO\", \"\")),  IF(E10= \"Trifásico\", IF(ISBLANK(K10), \"Inserir Demanda\", IF(AND(K10>0, K10<=32), \"40 PCV ou 32 AÇO\", \"Demanda deve ser 0-32 KVA\")), \"Falha, consultar Adminitrador\")))","v":""},{"$f":"P10+1","v":1},{"$f":"IF(AND(ISBLANK(E10),ISBLANK(D10), ISBLANK(I10), ISBLANK(F10), ISBLANK(J10)), \"0\", IF(OR(ISBLANK(E10), ISBLANK(F10), ISBLANK(J10),L10=\"\"), \"1\", IF(AND(E10= \"Trifásico\", OR(ISBLANK(F10), ISBLANK(J10), ISBLANK(K10))), \"1\", \"2\")))","v":"0"}]
[null,null,2,null,null,null,null,null,null,null,null,{"$f":"IF(OR(ISBLANK(D11),ISBLANK(E11),ISBLANK(F11),ISBLANK(G11), ISBLANK(H11),  ISBLANK(I11), ISBLANK(J11), ISBLANK(K11)), \"\", IF(E11= \"Monofásico\", IF(AND(J11>0, J11<=3), \"15 ou 16\", IF(AND(J11>3, J11<=8), \"40\", IF(AND(J11>8, J11<=10), \"50\", IF(AND(J11>10, J11<=15), \"70\", \"\")))),  IF(E11= \"Trifásico\", IF(ISBLANK(K11), \"Inserir Demanda\", IF(AND(K11>0, K11<=25), \"40\",  IF(AND(K11>25, K11<=32), \"60 ou 63\", \"Demanda deve ser 0-32 KVA\"))), \"Falha, consultar Adminitrador\")))","v":""},{"$f":"IF(OR(ISBLANK(D11), ISBLANK(E11), ISBLANK(F11),ISBLANK(G11),ISBLANK(H11),ISBLANK(I11), ISBLANK(J11),ISBLANK(K11)), \"\", IF(E11= \"Monofásico\", IF(AND(J11>0, J11<=8), \"CU-6(6)-XLPE/EPR ou CU-6(6)-PVC\", IF(AND(J11>8, J11<=10), \"CU-10(10)-XLPE/EPR ou CU-10(10)-PVC\", IF(AND(J11>10, J11<=15), \"CU-16(16)-XLPE/EPR ou CU-16(16)-PVC\", \"\"))),  IF(E11= \"Trifásico\", IF(ISBLANK(K11), \"Inserir Demanda\", IF(AND(K11>0, K11<=25), \"CU-10(10)-XLPE/EPR ou CU-10(10)-PVC \", IF(AND(K11>25, K11<=32), \"CU-16(16)-XLPE/EPR ou CU-16(16)-PVC \", \"Demanda deve ser 0-32 KVA\"))), \"Falha, consultar Adminitrador\")))","v":""},{"$f":"IF(OR(ISBLANK(D11), ISBLANK(E11),ISBLANK(F11),ISBLANK(G11), ISBLANK(H11),ISBLANK(I11), ISBLANK(J11),ISBLANK(K11)), \"\", IF(E11= \"Monofásico\", IF(AND(J11>0, J11<=8), \"25 PVC ou 25 AÇO\", IF(AND(J11>8, J11<=15), \"25 PVC ou 25 AÇO\", \"\")),  IF(E11= \"Trifásico\", IF(ISBLANK(K11), \"Inserir Demanda\", IF(AND(K11>0, K11<=32), \"40 PCV ou 32 AÇO\", \"Demanda deve ser 0-32 KVA\")), \"Falha, consultar Adminitrador\")))","v":""},{"$f":"P11+1","v":1},{"$f":"IF(AND(ISBLANK(E11),ISBLANK(D11), ISBLANK(I11), ISBLANK(F11), ISBLANK(J11)), \"0\", IF(OR(ISBLANK(E11), ISBLANK(F11), ISBLANK(J11),L11=\"\"), \"1\", IF(AND(E11= \"Trifásico\", OR(ISBLANK(F11), ISBLANK(J11), ISBLANK(K11))), \"1\", \"2\")))","v":"0"}]
[null,null,3,null,null,null,null,null,null,null,null,"","","",1,"0"]
[null,null,4,null,null,null,null,null,null,null,null,"","","",1,"0"]
[null,null,5,null,null,null,null,null,null,null,null,"","","",1,"0"]
[null,null,6,null,null,null,null,null,null,null,null,"","","",1,"0"]
[null,null,7,null,null,null,null,null,null,null,null,"","","",1,"0"]
[null,null,8,null,null,null,null,null,null,null,null,"","","",1,"0"]
[null,null,9,null,null,null,null,null,null,null,null,"","","",1,"0"]
[null,null,10,null,null,null,null,null,null,null,null,"","","",1,"0"]
[null,null,11,null,null,null,null,null,null,null,null,"","","",1,"0"]
[null,null,12,null,null,null,null,null,null,null,null,"","","",1,"0"]
[null,null,13,null,null,null,null,null,null,null,null,"","","",1,"0"]
[null,null,14,null,null,null,null,null,null,null,null,"","","",1,"0"]
[null,null,15,null,null,null,null,null,null,null,null,"","","",1,"0"]
[null,null,16,null,null,null,null,null,null,null,null,"","","",1,"0"]
[null,null,17,null,null,null,null,null,null,null,null,"","","",1,"0"]
[null,null,18,null,null,null,null,null,null,null,null,"","","",1,"0"]
[null,null,19,null,null,null,null,null,null,null,null,"","","",1,"0"]
[null,null,20,null,null,null,null,null,null,null,null,"","","",1,"0"]
[null,null,21,null,null,null,null,null,null,null,null,"","","",1,"0"]
[null,null,22,null,null,null,null,null,null,null,null,"","","",1,"0"]
[null,null,23,null,null,null,null,null,null,null,null,"","","",1,"0"]
[null,null,24,null,null,null,null,null,null,null,null,"","","",1,"0"]
[null,null,{"$f":"IF(ISBLANK(PAGE2!K12),\"ATENÇÃO: PREENCHER MATERIAL DO QUADRO NA PAGINA ANTERIOR.\",IF(PAGE2!K12=\"POLICARBONATO\",\"\",IF(PAGE2!K12=\"METALICO\",IF(AND(COUNTIF(E10:E33,\"Trifásico\")<1,COUNTIF(PAGE5!E10:E33,\"Monofásico\")<=19),\"\",IF(AND(COUNTIF(E10:E33,\"Trifásico\")=1,COUNTIF(PAGE5!E10:E33,\"Monofásico\")<=18),\"\",IF(AND(COUNTIF(E10:E33,\"Trifásico\")>1,COUNTBLANK(E10:E33)>=11),\"\",\"ATENÇÃO: QUADRO MODELO METÁLICO, EXCEDIDA A CAPACIDADE DE MEDIDORES PERMITIDOS. FAVOR VERIFICAR NORMA TAL, ONDE INFORMA A DISPOSIÇÃO DOS MEDIDORES NOS TIPOS DE QUADROS.\"))))))","v":"ATENÇÃO: PREENCHER MATERIAL DO QUADRO NA PAGINA ANTERIOR."},null,null,null,null,null,null,null,null,null,null,null,5,{"$f":"IF(OR(B37= \"1\",P10= \"1\",P11= \"1\",P12= \"1\",P13= \"1\",P14= \"1\",P15= \"1\",P16= \"1\",P17= \"1\",P18= \"1\",P19= \"1\",P20= \"1\",P21= \"1\",P22= \"1\",P23= \"1\",P24= \"1\",P25= \"1\",P26= \"1\",P27= \"1\",P28= \"1\",P29= \"1\",P30= \"1\",P31= \"1\",P32= \"1\",P33= \"1\"), \"1\", IF(AND(P10= \"0\", P11= \"0\",P12= \"0\",P13= \"0\",P14= \"0\",P15= \"0\",P16= \"0\",P17= \"0\",P18= \"0\",P19= \"0\",P20= \"0\",P21= \"0\",P22= \"0\",P23= \"0\",P24= \"0\",P25= \"0\",P26= \"0\",P27= \"0\",P28= \"0\",P29= \"0\",P30= \"0\",P31= \"0\",P32= \"0\",P33= \"0\"),\"0\",\"2\"))","v":"1"}]
[null,null,null,null,null,null,null,null,null,null,"Situação do documento:   ",null,"Falha ao Gerar Formulário",null,null,{"$f":"P34+O34","v":6}]
[null,null,null,null,null,null,null,null,null,null,"Situação do documento:   ",null,"Formulário Preenchido com sucesso"]
[null,{"$f":"IF(C34=\"\",\"2\",\"1\")","v":"1"}]

{"sheet":"PAGE9","index":9,"n_rows":53,"n_cols":9,"rows_kept":53,"cut":false,"hidden":false,"merged":[[9,6,9,7]]}
[]
[]
[]
[]
[]
[null,null,null,null,"Total de itens:",40]
[null,null,null,null,"Conforme",{"$f":"COUNTIF(H11:H53,3)","v":9}]
[null,null,null,null,"Inconforme",{"$f":"COUNTIF(H11:H52, 2)","v":33}]
[]
[null,null,"Item","Campo","Local","Situação","Status"]
[null,null,1,"ART","PAG_DADOS_OBRA",{"$f":"IF(ISBLANK(PAGE1!G7), \"VAZIO\", \"PREENCHIDO\")","v":"VAZIO"},"Ver",{"$f":"I11+1","v":2},{"$f":"IF(F11=\"VAZIO\", \"1\", \"2\")","v":"1"}]
[null,null,2,"SOLICITANTE","PAG_DADOS_OBRA",{"$f":"IF(ISBLANK(PAGE1!D10), \"VAZIO\", \"PREENCHIDO\")","v":"VAZIO"},"Ver",{"$f":"I12+1","v":2},{"$f":"IF(F12=\"VAZIO\", \"1\", \"2\")","v":"1"}]
[null,null,3,"CPF_CNPJ","PAG_DADOS_OBRA",{"$f":"IF(ISBLANK(PAGE1!J10), \"VAZIO\", \"PREENCHIDO\")","v":"VAZIO"},"Ver",2,"1"]
[null,null,4,"EMAIL_SOLICITANTE","PAG_DADOS_OBRA",{"$f":"IF(ISBLANK(PAGE1!D13), \"VAZIO\", \"PREENCHIDO\")","v":"VAZIO"},"Ver",2,"1"]
[null,null,5,"EMAIL_PROJETISTA","PAG_DADOS_OBRA",{"$f":"IF(ISBLANK(PAGE1!J13), \"VAZIO\", \"PREENCHIDO\")","v":"VAZIO"},"Ver",2,"1"]
[null,null,6,"TELEFONE_SOLICITANTE","PAG_DADOS_OBRA",{"$f":"IF(ISBLANK(PAGE1!D16), \"VAZIO\", \"PREENCHIDO\")","v":"VAZIO"},"Ver",2,"1"]
[null,null,7,"TELEFONE_PROJETISTA","PAG_DADOS_OBRA",{"$f":"IF(ISBLANK(PAGE1!J16), \"VAZIO\", \"PREENCHIDO\")","v":"VAZIO"},"Ver",2,"1"]
[null,null,8,"END_LOGRADOURO","PAG_DADOS_OBRA",{"$f":"IF(ISBLANK(PAGE1!F20), \"VAZIO\", \"PREENCHIDO\")","v":"VAZIO"},"Ver",2,"1"]
[null,null,9,"END_N_CASA","PAG_DADOS_OBRA",{"$f":"IF(ISBLANK(PAGE1!N20), \"VAZIO\", \"PREENCHIDO\")","v":"VAZIO"},"Ver",2,"1"]
[null,null,10,"END_CEP","PAG_DADOS_OBRA",{"$f":"IF(ISBLANK(PAGE1!E22), \"VAZIO\", \"PREENCHIDO\")","v":"VAZIO"},"Ver",2,"1"]
[null,null,11,"END_BAIRRO","PAG_DADOS_OBRA",{"$f":"IF(ISBLANK(PAGE1!J22), \"VAZIO\", \"PREENCHIDO\")","v":"VAZIO"},"Ver",2,"1"]
[null,null,12,"END_CIDADE","PAG_DADOS_OBRA",{"$f":"IF(ISBLANK(PAGE1!E24), \"VAZIO\", \"PREENCHIDO\")","v":"VAZIO"},"Ver",2,"1"]
[null,null,13,"END_COMPLEMENTO","PAG_DADOS_OBRA",{"$f":"IF(ISBLANK(PAGE1!K24), \"VAZIO\", \"PREENCHIDO\")","v":"VAZIO"},"Ver",2,{"$f":"IF(F23=\"VAZIO\", \"1\", \"2\")","v":"1"}]
[null,null,14,"LATITUDE","PAG_DADOS_OBRA",{"$f":"IF(ISBLANK(PAGE1!M18), \"VAZIO\", \"PREENCHIDO\")","v":"VAZIO"},"Ver",2,{"$f":"IF(F24=\"VAZIO\", \"1\", \"2\")","v":"1"}]
[null,null,15,"LONGITUDE","PAG_DADOS_OBRA",{"$f":"IF(ISBLANK(PAGE1!M18), \"VAZIO\", \"PREENCHIDO\")","v":"VAZIO"},"Ver",2,"1"]
[null,null,16,"DISTANCIA_POSTE_CONCESSIONÁRIA","PAG_DADOS_OBRA",{"$f":"IF(ISBLANK(PAGE1!M28), \"VAZIO\", \"PREENCHIDO\")","v":"VAZIO"},"Ver",2,{"$f":"IF(F26=\"VAZIO\", \"1\", \"2\")","v":"1"}]
[null,null,17,"BARRAMENTO_CONCESSIONÁRIA","PAG_DADOS_OBRA",{"$f":"IF(ISBLANK(PAGE1!M30), \"VAZIO\", \"PREENCHIDO\")","v":"VAZIO"},"Ver",2,{"$f":"IF(AND(F28=\"VAZIO\",F27=\"VAZIO\"), \"1\", \"2\")","v":"1"}]
[null,null,18,"MEDIDOR_VIZINHO","PAG_DADOS_OBRA",{"$f":"IF(ISBLANK(PAGE1!J32), \"VAZIO\", \"PREENCHIDO\")","v":"VAZIO"},"Ver",2,{"$f":"IF(AND(F28=\"VAZIO\",F27=\"VAZIO\"), \"1\", \"2\")","v":"1"}]
[null,null,19,"QUANTIDADE_CONSUMIDORES","PAG_QDG",{"$f":"IF(ISBLANK(PAGE2!I7), \"VAZIO\", IF(PAGE2!I7= SUM(COUNTIF(PAGE5!P10:P33,\"2\"),COUNTIF(PAGE6!P10:P33,\"2\"), COUNTIF(PAGE7!P10:P33,\"2\"), COUNTIF(PAGE8!P10:P33,\"2\")),\"PREENCHIDO CORRETO\",\"QUANT. DIFERENTE DO DECLARADO\"))","v":"VAZIO"},"Ver",2,{"$f":"IF(F29=\"VAZIO\", \"1\",IF(F29=\"PREENCHIDO CORRETO\", \"2\", IF(F29=\"QUANT. DIFERENTE DO DECLARADO\",\"1\")))","v":"1"}]
[null,null,20,"MATERIAL_QDG","PAG_QDG",{"$f":"IF(ISBLANK(PAGE2!G12), \"VAZIO\", \"PREENCHIDO\")","v":"VAZIO"},"Ver",2,"1"]
[null,null,21,"MATERIAL_QD_PARCIAL_1","PAG_QDG",{"$f":"IF(ISBLANK(PAGE2!I12), \"VAZIO\", \"PREENCHIDO\")","v":"VAZIO"},"Ver",3,{"$f":"IF(F31=\"VAZIO\", \"2\", \"2\")","v":"2"}]
[null,null,22,"MATERIAL_QD_PARCIAL_2","PAG_QDG",{"$f":"IF(ISBLANK(PAGE2!K12), \"VAZIO\", \"PREENCHIDO\")","v":"VAZIO"},"Ver",3,{"$f":"IF(F32=\"VAZIO\", \"2\", \"2\")","v":"2"}]
[null,null,23,"MATERIAL_QD_PARCIAL_3","PAG_QDG",{"$f":"IF(ISBLANK(PAGE2!M12), \"VAZIO\", \"PREENCHIDO\")","v":"VAZIO"},"Ver",3,{"$f":"IF(F33=\"VAZIO\", \"2\", \"2\")","v":"2"}]
[null,null,24,"DEMANDA_QDG","PAG_QDG",{"$f":"IF(OR(ISBLANK(PAGE2!G13),PAGE2!G13=0), \"VAZIO\", \"PREENCHIDO\")","v":"VAZIO"},"Ver",{"$f":"I34+1","v":2},{"$f":"IF(F34=\"VAZIO\", \"1\", \"2\")","v":"1"}]
[null,null,25,"DEMANDA_QD_PARCIAL_1","PAG_QDG",{"$f":"IF(ISBLANK(PAGE2!I13), \"VAZIO\", \"PREENCHIDO\")","v":"VAZIO"},"Ver",3,{"$f":"IF(F35=\"VAZIO\", \"2\", \"2\")","v":"2"}]
[null,null,26,"DEMANDA_QD_PARCIAL_2","PAG_QDG",{"$f":"IF(ISBLANK(PAGE2!K13), \"VAZIO\", \"PREENCHIDO\")","v":"VAZIO"},"Ver",3,{"$f":"IF(F36=\"VAZIO\", \"2\", \"2\")","v":"2"}]
[null,null,27,"DEMANDA_QD_PARCIAL_3","PAG_QDG",{"$f":"IF(ISBLANK(PAGE2!M13), \"VAZIO\", \"PREENCHIDO\")","v":"VAZIO"},"Ver",3,"2"]
[null,null,28,"CONSUMIDOR_QDG","PAG_QDG",{"$f":"IF(PAGE2!H22= 1,\"VAZIO\", IF( PAGE2!H22=2,  \"INCOMPLETO\", IF(PAGE2!H22= 3, \"PREENCHIMENTO INCORRETO\", IF(PAGE2!H22 = 4, \"PREENCHIMENTO CORRETO\", \"INFO NÃO LOCALIZADA\"))))","v":"VAZIO"},"Ver",2,{"$f":"IF(OR(F38= \"VAZIO\", F38= \"INCOMPLETO\", F38 = \"PREENCHIMENTO INCORRETO\"),\"1\", IF(F38= \"PREENCHIMENTO CORRETO\", \"2\", \"0\"))","v":"1"}]
[null,null,29,"CONSUMIDOR_QD_PARCIAL_1","PAG_QDG",{"$f":"IF(PAGE2!J22= 1,\"VAZIO\", IF( PAGE2!J22=2,  \"INCOMPLETO\", IF(PAGE2!J22= 3, \"PREENCHIMENTO INCORRETO\", IF(PAGE2!J22 = 4, \"PREENCHIMENTO CORRETO\", \"INFO NÃO LOCALIZADA\"))))","v":"VAZIO"},"Ver",3,{"$f":"IF(F39= \"VAZIO\", \"2\", IF(OR(F39= \"INCOMPLETO\", F39 = \"PREENCHIMENTO INCORRETO\"),\"2\", IF(F39= \"PREENCHIMENTO CORRETO\", \"2\", \"0\")))","v":"2"}]
[null,null,30,"CONSUMIDOR_QD_PARCIAL_2","PAG_QDG",{"$f":"IF(PAGE2!J23= 1,\"VAZIO\", IF( PAGE2!J23=2,  \"INCOMPLETO\", IF(PAGE2!J23= 3, \"PREENCHIMENTO INCORRETO\", IF(PAGE2!J23 = 4, \"PREENCHIMENTO CORRETO\", \"INFO NÃO LOCALIZADA\"))))","v":"INFO NÃO LOCALIZADA"},"Ver",3,{"$f":"IF(F40= \"VAZIO\", \"2\", IF(OR(F40= \"INCOMPLETO\", F40 = \"PREENCHIMENTO INCORRETO\"),\"2\", IF(F40= \"PREENCHIMENTO CORRETO\", \"2\", \"0\")))","v":"0"}]
[null,null,31,"CONSUMIDOR_QD_PARCIAL_3","PAG_QDG",{"$f":"IF(PAGE2!N22= 1,\"VAZIO\", IF( PAGE2!N22=2,  \"INCOMPLETO\", IF(PAGE2!N22= 3, \"PREENCHIMENTO INCORRETO\", IF(PAGE2!N22 = 4, \"PREENCHIMENTO CORRETO\", \"INFO NÃO LOCALIZADA\"))))","v":"INFO NÃO LOCALIZADA"},"Ver",3,{"$f":"IF(F41= \"VAZIO\", \"2\", IF(OR(F41= \"INCOMPLETO\", F41 = \"PREENCHIMENTO INCORRETO\"),\"2\", IF(F41= \"PREENCHIMENTO CORRETO\", \"2\", \"0\")))","v":"0"}]
[null,null,32,"POSICAO_QDG","PAG_QDG",{"$f":"IF(ISBLANK(PAGE2!G26), \"VAZIO\", IF(PAGE2!G26= \"SIM\", \"PREENCHIDO COM SIM\", IF(PAGE2!G26= \"NÃO\", \"PREENCHIDO COM NÃO\", \"INFO NÃO LOCALIZADA\")))","v":"VAZIO"},"Ver",2,{"$f":"IF(F42=\"VAZIO\", \"1\", IF(F42= \"PREENCHIDO COM SIM\", \"2\", IF(AND(F42= \"PREENCHIDO COM NÃO\",F43= \"JUSTIFICADO\"), \"2\", \"1\")))","v":"1"}]
[null,null,33,"JUSTIFICATIVA_POSICAO","PAG_QDG",{"$f":"IF(ISBLANK(PAGE2!J26), \"VAZIO\", \"JUSTIFICADO\")","v":"VAZIO"},"Ver",2,{"$f":"IF(AND(F42= \"PREENCHIDO COM NÃO\",F43= \"JUSTIFICADO\"), \"2\",IF(AND(F42= \"PREENCHIDO COM SIM\", F43= \"VAZIO\"),\"2\", \"1\"))","v":"1"}]
[null,null,34,"LIMITE_DISTANCIA_QDG","PAG_QDG",{"$f":"IF(ISBLANK(PAGE2!L29), \"VAZIO\", IF(PAGE2!L29= \"SIM\", \"PREENCHIDO COM SIM\", IF(PAGE2!L29= \"NÃO\", \"PREENCHIDO COM NÃO\", \"N/A\")))","v":"VAZIO"},"Ver",2,{"$f":"IF(AND(OR(F42= \"PREENCHIDO COM NÃO\",F42= \"VAZIO\"), OR(F44= \"PREENCHIDO COM NÃO\",F44= \"VAZIO\")), \"1\", IF(F42= \"VAZIO\", \"1\",\"2\"))","v":"1"}]
[null,null,35,"IDENTIFICACAO_LOCAL_MEDIDOR","PAG_QDG",{"$f":"IF(ISBLANK(PAGE2!L32), \"VAZIO\", IF(PAGE2!L32= \"SIM\", \"PREENCHIDO COM SIM\", IF(PAGE2!L32= \"NÃO\", \"PREENCHIDO COM NÃO\", \"INFO NÃO LOCALIZADA\")))","v":"VAZIO"},"Ver",2,{"$f":"IF(F45=\"PREENCHIDO COM SIM\", \"2\", \"1\")","v":"1"}]
[null,null,36,"ATERRAMENTO_PADRONIZADO","PAG_INSTALACAO",{"$f":"IF(PAGE3!N8= \"SIM\", \"PREENCHIDO COM SIM\",  IF(PAGE3!N8= \"NÃO\",\"PREENCHIDO COM NÃO\", \"VAZIO\"))","v":"VAZIO"},"Ver",2,{"$f":"IF(F46= \"PREENCHIDO COM SIM\", \"2\", \"1\")","v":"1"}]
[null,null,37,"POSSUI_CAIXA_PASSAGEM","PAG_INSTALACAO",{"$f":"IF(PAGE3!G14= \"SIM\", \"PREENCHIDO COM SIM\",  IF(PAGE3!G14= \"NÃO\",\"PREENCHIDO COM NÃO\", \"VAZIO\"))","v":"VAZIO"},"Ver",2,{"$f":"IF(F47 = \"PREENCHIDO COM NÃO\", \"2\", IF(AND(F47= \"PREENCHIDO COM SIM\",F48= \"PREENCHIDO COM SIM\"), \"2\", \"1\"))","v":"1"}]
[null,null,38,"CAIXA_PADRONIZADA","PAG_INSTALACAO",{"$f":"IF(PAGE3!N14= \"SIM\", \"PREENCHIDO COM SIM\",  IF(PAGE3!N14= \"NÃO\",\"PREENCHIDO COM NÃO\", \"VAZIO\"))","v":"VAZIO"},"Ver",2,{"$f":"IF(F47 = \"PREENCHIDO COM NÃO\", \"2\", IF(AND(F47= \"PREENCHIDO COM SIM\",F48= \"PREENCHIDO COM SIM\"), \"2\", \"1\"))","v":"1"}]
[null,null,39,"POSSUI_BOMBA_INCENDIO","PAG_INSTALACAO",{"$f":"IF(PAGE3!G18= \"SIM\", \"PREENCHIDO COM SIM\",  IF(PAGE3!G18= \"NÃO\",\"PREENCHIDO COM NÃO\", \"VAZIO\"))","v":"VAZIO"},"Ver",2,{"$f":"IF(F49 = \"PREENCHIDO COM NÃO\", \"2\", IF(AND(F49= \"PREENCHIDO COM SIM\",F50= \"PREENCHIDO COM SIM\"), \"2\", \"1\"))","v":"1"}]
[null,null,40,"BOMBA_INCENDIO_PADRONIZADA","PAG_INSTALACAO",{"$f":"IF(PAGE3!N18= \"SIM\", \"PREENCHIDO COM SIM\",  IF(PAGE3!N18= \"NÃO\",\"PREENCHIDO COM NÃO\", \"VAZIO\"))","v":"VAZIO"},"Ver",2,{"$f":"IF(F49 = \"PREENCHIDO COM NÃO\", \"2\", IF(AND(F49= \"PREENCHIDO COM SIM\",F50= \"PREENCHIDO COM SIM\"), \"2\", \"1\"))","v":"1"}]
[null,null,41,"TIPO_CABO_RAMAL_ENTRADA","PAG_INSTALACAO",{"$f":"IF(PAGE3!H22= \"SIM\", \"PREENCHIDO COM SIM\",  IF(PAGE3!H22= \"NÃO\",\"PREENCHIDO COM NÃO\", \"VAZIO\"))","v":"VAZIO"},"Ver",2,{"$f":"IF(F51=\"VAZIO\", \"1\", \"2\")","v":"1"}]
[null,null,42,"TERMINAL_PADRONIZADO","PAG_INSTALACAO",{"$f":"IF(PAGE3!H27= \"SIM\", \"PREENCHIDO COM SIM\",  IF(PAGE3!H27= \"NÃO\",\"PREENCHIDO COM NÃO\", \"VAZIO\"))","v":"VAZIO"},"Ver",2,{"$f":"IF(F52=\"PREENCHIDO COM SIM\", \"2\", \"1\")","v":"1"}]
[null,null,42,"DEMANDA_QDG_CALCULADA","PAG_DEMANDA",{"$f":"IF(OR(ISBLANK(PAGE2!G13),PAGE2!G13=0,PAGE2!G13>50), \"VAZIO OU DEMANDA DEVE SER <=50kVA\", \"PREENCHIDO\")","v":"VAZIO OU DEMANDA DEVE SER <=50kVA"},"Ver",2,{"$f":"IF(F53=\"VAZIO OU DEMANDA DEVE SER <=50kVA\", \"1\", \"2\")","v":"1"}]

{"sheet":"PAGE10","index":10,"n_rows":205,"n_cols":17,"rows_kept":205,"cut":false,"hidden":false,"merged":[[87,5,89,17],[1,2,1,4],[1,14,1,15],[1,11,1,13],[1,8,1,10],[48,4,48,17],[26,3,26,17],[7,7,7,11],[3,7,3,10],[3,11,3,13],[40,4,40,7],[36,3,36,10],[32,3,32,11],[43,16,43,17],[44,11,44,13],[41,4,41,7],[41,8,41,10],[41,11,41,13],[41,14,41,15],[41,16,41,17],[10,3,10,11],[12,3,12,6],[12,13,12,15],[34,3,34,17],[38,3,38,10],[40,11,40,13],[55,8,56,16],[45,4,45,7],[44,4,44,7],[43,4,43,7],[42,4,42,7],[47,4,47,7],[46,4,46,7],[51,3,51,17],[52,3,52,17],[49,4,49,17],[42,11,42,13],[42,14,42,15],[42,16,42,17],[43,11,43,13],[43,14,43,15],[44,14,44,15],[44,16,44,17],[45,11,45,13],[45,14,45,15],[45,16,45,17],[40,14,40,15],[40,16,40,17],[202,8,202,10],[203,8,203,10],[20,3,20,4],[24,5,24,10],[67,5,68,17],[69,5,69,17],[75,5,75,17],[73,5,73,17],[79,5,79,17],[81,5,81,17],[85,5,85,17],[92,5,92,17],[36,14,36,15],[38,14,38,15],[152,6,152,15],[101,6,101,15],[77,3,77,17],[65,3,65,17],[63,3,63,17],[60,5,61,17],[57,5,58,17],[54,5,54,13],[55,5,55,7],[32,15,32,16],[30,15,30,16],[15,3,15,6],[15,13,15,15],[198,16,198,17],[199,6,199,7],[199,14,199,15],[199,16,199,17],[196,6,196,7],[196,14,196,15],[186,6,186,7],[186,14,186,15],[182,6,182,7],[182,14,182,15],[186,16,186,17],[187,6,187,7],[187,14,187,15],[187,16,187,17],[184,6,184,7],[184,14,184,15],[184,16,184,17],[185,6,185,7],[196,16,196,17],[197,6,197,7],[197,14,197,15],[200,6,200,7],[200,14,200,15],[40,8,40,10],[42,8,42,10],[43,8,43,10],[44,8,44,10],[45,8,45,10],[46,8,46,10],[47,8,47,10],[83,3,83,17],[71,3,71,17],[46,11,46,13],[46,14,46,15],[46,16,46,17],[47,11,47,13],[47,14,47,15],[47,16,47,17],[120,14,120,15],[180,6,180,7],[180,14,180,15],[180,16,180,17],[181,6,181,7],[181,14,181,15],[181,16,181,17],[197,16,197,17],[188,6,188,7],[188,14,188,15],[188,16,188,17],[189,6,189,7],[189,14,189,15],[189,16,189,17],[194,6,194,7],[194,14,194,15],[194,16,194,17],[195,6,195,7],[195,14,195,15],[195,16,195,17],[200,16,200,17],[201,6,201,7],[201,14,201,15],[201,16,201,17],[198,6,198,7],[198,14,198,15],[185,14,185,15],[185,16,185,17],[182,16,182,17],[183,6,183,7],[183,14,183,15],[183,16,183,17],[190,6,190,7],[190,14,190,15],[190,16,190,17],[191,6,191,7],[191,14,191,15],[191,16,191,17],[192,6,192,7],[192,14,192,15],[192,16,192,17],[193,6,193,7],[193,14,193,15],[193,16,193,17],[164,14,164,15],[164,16,164,17],[171,6,171,7],[171,14,171,15],[171,16,171,17],[174,16,174,17],[175,6,175,7],[175,14,175,15],[175,16,175,17],[172,6,172,7],[172,14,172,15],[172,16,172,17],[173,6,173,7],[173,14,173,15],[173,16,173,17],[164,6,164,7],[174,6,174,7],[174,14,174,15],[166,6,166,7],[166,14,166,15],[166,16,166,17],[167,6,167,7],[167,14,167,15],[167,16,167,17],[162,16,162,17],[163,6,163,7],[163,14,163,15],[163,16,163,17],[160,6,160,7],[160,14,160,15],[160,16,160,17],[161,6,161,7],[161,14,161,15],[161,16,161,17],[162,6,162,7],[162,14,162,15],[154,6,154,7],[154,14,154,15],[158,16,158,17],[159,6,159,7],[159,14,159,15],[159,16,159,17],[156,6,156,7],[156,14,156,15],[156,16,156,17],[157,6,157,7],[157,14,157,15],[157,16,157,17],[158,6,158,7],[158,14,158,15],[139,16,139,17],[147,14,147,15],[148,14,148,15],[149,14,149,15],[139,14,139,15],[146,14,146,15],[152,16,152,17],[139,6,139,7],[129,16,129,17],[130,16,130,17],[131,16,131,17],[132,16,132,17],[133,16,133,17],[135,14,135,15],[136,14,136,15],[137,14,137,15],[138,14,138,15],[129,14,129,15],[130,14,130,15],[131,14,131,15],[132,14,132,15],[133,14,133,15],[134,14,134,15],[134,16,134,17],[124,6,124,7],[125,6,125,7],[122,6,122,7],[135,16,135,17],[136,16,136,17],[137,16,137,17],[138,16,138,17],[129,6,129,7],[130,6,130,7],[131,6,131,7],[132,6,132,7],[133,6,133,7],[134,6,134,7],[135,6,135,7],[136,6,136,7],[137,6,137,7],[138,6,138,7],[107,14,107,15],[108,14,108,15],[109,14,109,15],[110,16,110,17],[111,16,111,17],[112,16,112,17],[119,6,119,7],[114,14,114,15],[115,14,115,15],[116,14,116,15],[117,14,117,15],[118,14,118,15],[119,14,119,15],[114,16,114,17],[115,16,115,17],[116,16,116,17],[117,16,117,17],[118,16,118,17],[119,16,119,17],[5,3,5,17],[7,3,7,6],[9,3,9,6],[107,6,107,7],[108,6,108,7],[109,6,109,7],[110,6,110,7],[111,6,111,7],[100,14,100,15],[100,16,100,17],[101,16,101,17],[90,3,90,17],[100,6,100,7],[102,14,102,15],[102,16,102,17],[103,14,103,15],[104,14,104,15],[105,14,105,15],[102,6,102,7],[103,6,103,7],[104,6,104,7],[105,6,105,7],[103,16,103,17],[106,6,106,7],[16,13,16,15],[24,11,24,12],[22,11,22,12],[13,13,13,15],[10,13,10,15],[22,5,22,8],[20,5,20,14],[22,13,22,16],[24,13,24,16],[13,3,13,11],[16,3,16,11],[18,3,18,10],[18,12,18,13],[18,15,18,16],[95,8,95,10],[95,11,95,13],[96,8,96,10],[96,11,96,13],[114,6,114,7],[115,6,115,7],[116,6,116,7],[117,6,117,7],[118,6,118,7],[98,3,98,17],[113,16,113,17],[110,14,110,15],[112,6,112,7],[113,6,113,7],[104,16,104,17],[105,16,105,17],[106,16,106,17],[113,14,113,15],[107,16,107,17],[108,16,108,17],[109,16,109,17],[111,14,111,15],[112,14,112,15],[106,14,106,15],[140,6,140,7],[140,14,140,15],[140,16,140,17],[120,16,120,17],[121,16,121,17],[123,6,123,7],[120,6,120,7],[121,6,121,7],[121,14,121,15],[128,6,128,7],[128,14,128,15],[128,16,128,17],[122,16,122,17],[123,16,123,17],[124,16,124,17],[125,16,125,17],[127,16,127,17],[123,14,123,15],[124,14,124,15],[125,14,125,15],[126,16,126,17],[126,6,126,15],[127,6,127,15],[122,14,122,15],[150,14,150,15],[151,14,151,15],[141,6,141,7],[141,14,141,15],[141,16,141,17],[142,6,142,7],[142,14,142,15],[142,16,142,17],[143,6,143,7],[143,14,143,15],[143,16,143,17],[146,6,146,7],[147,6,147,7],[148,6,148,7],[149,6,149,7],[150,6,150,7],[151,6,151,7],[178,6,178,7],[178,14,178,15],[144,6,144,7],[144,14,144,15],[144,16,144,17],[145,6,145,7],[145,14,145,15],[145,16,145,17],[165,6,165,7],[165,14,165,15],[165,16,165,17],[154,16,154,17],[155,6,155,7],[155,14,155,15],[155,16,155,17],[153,6,153,7],[153,14,153,15],[153,16,153,17],[146,16,146,17],[147,16,147,17],[148,16,148,17],[149,16,149,17],[150,16,150,17],[151,16,151,17],[203,16,203,17],[202,16,202,17],[203,11,203,12],[202,11,202,12],[204,3,204,17],[97,3,97,17],[168,6,168,7],[168,14,168,15],[168,16,168,17],[169,6,169,7],[169,14,169,15],[169,16,169,17],[170,6,170,7],[170,14,170,15],[170,16,170,17],[178,16,178,17],[179,6,179,7],[179,14,179,15],[179,16,179,17],[176,6,176,7],[176,14,176,15],[176,16,176,17],[177,16,177,17],[177,6,177,15]]}
[false,false]
[null,null,"Versão 1.3",null,null,null,null,null,"Data de Impressão:",null,null,{"$f":"NOW()","v":"2024-10-04T11:47:26.860"}]
[]
[]
[]
[null,null,null,"1 - Dados da obra"]
[]
[null,null,null,"1.1 - Número da  ART/TRT:",null,null,null,{"$f":"UPPER(PAGE1!G7)","v":""}]
[]
[null,null,null,"1.2 - Solicitante:",null,null,null,null,null,null,null,null,null,"1.3 - CPF/CNPJ"]
[null,null,null,{"$f":"UPPER(PAGE1!D10)","v":""},null,null,null,null,null,null,null,null,null,{"$f":"PAGE1!J10","v":0}]
[]
[null,null,null,"1.4 - E-mail Solicitante",null,null,null,null,null,null,null,null,null,"1.5 - Telefone Solicitante"]
[null,null,null,{"$f":"UPPER(PAGE1!D13)","v":""},null,null,null,null,null,null,null,null,null,{"$f":"PAGE1!J13","v":0}]
[]
[null,null,null,"1.6 - E-mail Projetista",null,null,null,null,null,null,null,null,null,"1.7 - Telefone Projetista"]
[null,null,null,{"$f":"UPPER(PAGE1!D16)","v":""},null,null,null,null,null,null,null,null,null,{"$f":"PAGE1!J16","v":0}]
[]
[null,null,null,"1.8 - Endereço da obra (conforme ART):",null,null,null,null,null,null,null,"Lat:",{"$f":"UPPER(PAGE1!J18)","v":""},null," Long:",{"$f":"UPPER(PAGE1!M18)","v":""}]
[]
[null,null,null,"Logradouro:",null,{"$f":"UPPER(PAGE1!F20)","v":""},null,null,null,null,null,null,null,null,null,"Nº:",{"$f":"PAGE1!N20","v":0}]
[]
[null,null,null,"CEP:",null,{"$f":"PAGE1!E22","v":0},null,null,null,null,null,"Bairro:",null,{"$f":"UPPER(PAGE1!J22)","v":""}]
[]
[null,null,null,"Cidade:",null,{"$f":"UPPER(PAGE1!E24)","v":""},null,null,null,null,null,"Comp. / Ref.:",null,{"$f":"UPPER(PAGE1!K24)","v":""}]
[]
[null,null,null,"2 - Referência elétrica"]
[]
[null,null,null,"2.1 -  Informe a distância do Ponto Conexão (PDE) até o limite da propriedade:",null,null,null,null,null,null,null,null,null,null,null,{"$f":"PAGE1!M28","v":0},"Metros"]
[]
[null,null,null,"2.2 - Informe o número da plaqueta que existe no poste da NEOENERGIA mais próximo: ",null,null,null,null,null,null,null,null,null,null,null,{"$f":"UPPER(PAGE1!M30)","v":""}]
[]
[null,null,null,"2.3 - Ou, número do medidor de energia mais próximo:",null,null,null,null,null,null,null,null,null,null,null,{"$f":"UPPER(PAGE1!J32)","v":""}]
[]
[null,null,null,"3 - Quadros de Distribuição (QD)"]
[]
[null,null,null,"3.1 - Quantidade de unidades consumidoras:",null,null,null,null,null,null,null,{"$f":"PAGE2!I7","v":0},null,null,"Carga Existente:",null,{"$f":"PAGE2!M7","v":"0 kW"}]
[]
[null,null,null,"3.2 - Dados do(s) Quadro(s) de Distribuição (QD's):",null,null,null,null,null,null,null,null,null,null,"Carga à instalar:",null,{"$f":"PAGE2!M8","v":"0 kW"}]
[]
[null,null,null,null,"Dados dos Quadros",null,null,null,"QDG**",null,null,"QD - Parcial 1",null,null,"QD - Parcial 2",null,"QD - Parcial 3"]
[null,null,null,null,"Material",null,null,null,{"$f":"IF(PAGE2!G12= \"\", \"\", PAGE2!G12)","v":""},null,null,{"$f":"IF(PAGE2!I12 = \"\", \"N/A\", PAGE2!I12)","v":"N/A"},null,null,{"$f":"IF(PAGE2!K12 = \"\", \"N/A\", PAGE2!K12)","v":"N/A"},null,{"$f":"IF(PAGE2!M12 = \"\", \"N/A\", PAGE2!M12)","v":"N/A"}]
[null,null,null,null,"Demanda Total (kVA)*",null,null,null,{"$f":"IF(PAGE2!G13= \"\", \"\", PAGE2!G13)","v":0},null,null,{"$f":"IF(PAGE2!I13= \"\", \"N/A\", PAGE2!I13)","v":"N/A"},null,null,{"$f":"IF(PAGE2!K13= \"\", \"N/A\", PAGE2!K13)","v":"N/A"},null,{"$f":"IF(PAGE2!M13= \"\", \"N/A\", PAGE2!M13)","v":"N/A"}]
[null,null,null,null,"Barramento de Cobre",null,null,null,{"$f":"PAGE2!G14","v":""},null,null,{"$f":"IF(PAGE2!I14= \"\", \"N/A\", PAGE2!I14)","v":"N/A"},null,null,{"$f":"IF(PAGE2!K14= \"\", \"N/A\", PAGE2!K14)","v":"N/A"},null,{"$f":"IF(PAGE2!M14= \"\", \"N/A\", PAGE2!M14)","v":"N/A"}]
[null,null,null,null,"Disjuntor Geral (A)",null,null,null,{"$f":"PAGE2!G15","v":""},null,null,{"$f":"IF(PAGE2!I15= \"\", \"N/A\", PAGE2!I15)","v":"N/A"},null,null,{"$f":"IF(PAGE2!K15= \"\", \"N/A\", PAGE2!K15)","v":"N/A"},null,{"$f":"IF(PAGE2!M15= \"\", \"N/A\", PAGE2!M15)","v":"N/A"}]
[null,null,null,null,"Cabo do Ramal de Entrada (mm²)",null,null,null,{"$f":"PAGE2!G16","v":""},null,null,{"$f":"IF(PAGE2!I16= \"\", \"N/A\", PAGE2!I16)","v":"N/A"},null,null,{"$f":"IF(PAGE2!K16= \"\", \"N/A\", PAGE2!K16)","v":"N/A"},null,{"$f":"IF(PAGE2!M16= \"\", \"N/A\", PAGE2!M16)","v":"N/A"}]
[null,null,null,null,"Diâmetro do Eletroduto",null,null,null,{"$f":"PAGE2!G17","v":""},null,null,{"$f":"IF(PAGE2!I17= \"\", \"N/A\", PAGE2!I17)","v":"N/A"},null,null,{"$f":"IF(PAGE2!K17= \"\", \"N/A\", PAGE2!K17)","v":"N/A"},null,{"$f":"IF(PAGE2!M17= \"\", \"N/A\", PAGE2!M17)","v":"N/A"}]
[null,null,null,null,"Ramal de Ligação Neoenergia",null,null,null,{"$f":"PAGE2!G18","v":""},null,null,{"$f":"IF(PAGE2!I18= \"\", \"N/A\", PAGE2!I18)","v":"N/A"},null,null,{"$f":"IF(PAGE2!K18= \"\", \"N/A\", PAGE2!K18)","v":"N/A"},null,{"$f":"IF(PAGE2!M18= \"\", \"N/A\", PAGE2!M18)","v":"N/A"}]
[null,null,null,null,"* O valor da demanda total deve ser igual à declarada na ART/TRT (ver aba informações no início). "]
[null,null,null,null,"** O valor da demanda calculada deve ser conforme metodologia  do Anexo I e a Categoria de Agrupamento conforme Tabela 5 do Anexo II. O ramal de conexão deve ser do tipo aéreo e a edificação deve apresentar apenas um centro de medição, seguindo as limitações de caixas de medição por barramento de cada modelo."]
[]
[null,null,null,"3.3 - Localização da instalação do QDG:"]
[null,null,null,"O QDG deve ser instalado voltado para a via pública, podendo ser instalado dentro da edificação mediante \nlimitação técnica."]
[]
[null,null,null,{"$f":"IF(PAGE2!G26= \"\", \"\", PAGE2!G26)","v":""},"3.3.1 -","O QDG está instalado com acesso livre para a via pública?"]
[null,null,null,null,null,"Se não, justificativa:",null,null,{"$f":"PAGE2!J26","v":0}]
[]
[null,null,null,{"$f":"IF(PAGE2!L29= \"\", \"\", PAGE2!L29)","v":""},"3.3.2 - ","Se não (caso esteja dentro da edificação), o QDG está instalado limitando-se o comprimento do condutor em 40m do ponto de conexão?"]
[]
[]
[null,null,null,{"$f":"IF(PAGE2!L32= \"\", \"\", PAGE2!L32)","v":""},"3.3.3 - ","Os locais de instalação dos medidores possuem identificação das unidades com placa 40x20mm em metal ou acrílico com texto em abaixo ou alto relevo?"]
[]
[]
[null,null,null,"4 - Informações da instalação"]
[]
[null,null,null,"4.1 - Aterramento"]
[]
[null,null,null,{"$f":"IF(PAGE3!N8= \"\", \"\", PAGE3!N8)","v":""},"4.1.1 - ","Todos os quadros estão aterrados e conectados através de poços de inspeção, conforme de-senho 36 do Anexo III da norma DIS-NOR-053, em malha de terra formada por no mínimo 3 hastes?"]
[]
[null,null,null,null,null,"Cabo para interligar a malha de  aterramento: 35mm² de cobre nú ou 2AWG de aço cobreado."]
[]
[null,null,null,"4.2 - Caixas de Passagens"]
[]
[null,null,null,{"$f":"IF(PAGE3!G14= \"\", \"\", PAGE3!G14)","v":""},"4.2.1 - ","Possui caixa de passagem do ramal de entrada?"]
[]
[null,null,null,{"$f":"IF(PAGE3!N14= \"\", \"N/A\", PAGE3!N14)","v":"N/A"},"4.2.2 - ","Se sim, as caixas de passagens serão instaladas conforme o Desenho 69 do Anexo III da norma DIS-NOR-053?"]
[]
[null,null,null,"4.3 - Bomba de Incêndio"]
[]
[null,null,null,{"$f":"IF(PAGE3!G18= \"\", \"\", PAGE3!G18)","v":""},"4.3.1 - ","É previsto bomba de incêndio para a edificação?"]
[]
[null,null,null,{"$f":"IF(PAGE3!N18= \"\", \"N/A\", PAGE3!N18)","v":"N/A"},"4.3.2 - ","A bomba de incêndio será instalada conforme item 6.20.1 da norma DIS-NOR-053?"]
[]
[null,null,null,"4.4 - Condutores"]
[]
[null,null,null,{"$f":"IF(PAGE3!H22= \"\", \"\", PAGE3!H22)","v":""},"4.4.1 - ","Os condutores são semi-rígidos (classe 2)?"]
[]
[null,null,null,null,null,"DIS-NOR-053 - Item 6.17.39: No caso da interligação seja executada com condutores com classe de encordoamento 5 (flexível), devem obrigatoriamente ter suas extremidades conectadas utilizando terminais maciços de compressão tipo curto aplicados com ferramenta apropriada e conforme recomendada pelo fabricante."]
[]
[]
[null,null,null,"4.5 - Terminais"]
[]
[null,null,null,{"$f":"IF(PAGE3!H27= \"\", \"\", PAGE3!H27)","v":""},"4.5.1 - ","Os terminais usados para conectar os condutores aos barramentos são de pressão?"]
[]
[]
[null,null,null,null,null,null,null,null,"Impressão:",null,null,{"$f":"NOW()","v":"2024-10-04T11:47:26.860"}]
[null,null,null,null,null,null,null,null,"ART:",null,null,{"$f":"UPPER(PAGE1!G7)","v":""}]
[null,null,null,{"$f":"UPPER(CONCATENATE(\"ANOTAÇÕES / INFORMAÇÕES ADICIONAIS: \",IF(ISBLANK(PAGE4!D8),\"NADA A DECLARAR.\",PAGE4!D8)))","v":"ANOTAÇÕES / INFORMAÇÕES ADICIONAIS: NADA A DECLARAR."}]
[null,null,null,"Informações de consumidores"]
[]
[null,null,null,"Item","Tipo","Tipo de Ligação","Unidade Consumidora",null,"N° Identif. (Ex.: 1A)","Pavimento","Área (m²)","Carga \nInstalada (kW)","Demanda (kVA)","Disjuntor de Proteção (A)","Ramal de \nDistribuição (mm²)",null,"Diâmetro do \nEletroduto (mm²)"]
[null,null,null,null,null,null,"QDG",null,null,null,null,null,null,null,null,null,"QDG"]
[null,null,null,1,{"$f":"PAGE5!D10","v":0},{"$f":"PAGE5!E10","v":0},{"$f":"PAGE5!F10","v":0},null,{"$f":"PAGE5!G10","v":0},{"$f":"PAGE5!H10","v":0},{"$f":"PAGE5!I10","v":0},{"$f":"IF(PAGE5!J10=0, \"-\", PAGE5!J10)","v":"-"},{"$f":"IF(PAGE5!K10=0, \"-\", PAGE5!K10)","v":"-"},{"$f":"PAGE5!L10","v":""},{"$f":"PAGE5!M10","v":""},null,{"$f":"PAGE5!N10","v":""}]
[null,null,null,2,{"$f":"PAGE5!D11","v":0},{"$f":"PAGE5!E11","v":0},{"$f":"PAGE5!F11","v":0},null,{"$f":"PAGE5!G11","v":0},{"$f":"PAGE5!H11","v":0},{"$f":"PAGE5!I11","v":0},{"$f":"IF(PAGE5!J11=0, \"-\", PAGE5!J11)","v":"-"},{"$f":"IF(PAGE5!K11=0, \"-\", PAGE5!K11)","v":"-"},{"$f":"PAGE5!L11","v":""},{"$f":"PAGE5!M11","v":""},null,{"$f":"PAGE5!N11","v":""}]
[null,null,null,3,{"$f":"PAGE5!D12","v":0},{"$f":"PAGE5!E12","v":0},{"$f":"PAGE5!F12","v":0},null,{"$f":"PAGE5!G12","v":0},{"$f":"PAGE5!H12","v":0},{"$f":"PAGE5!I12","v":0},{"$f":"IF(PAGE5!J12=0, \"-\", PAGE5!J12)","v":"-"},{"$f":"IF(PAGE5!K12=0, \"-\", PAGE5!K12)","v":"-"},{"$f":"PAGE5!L12","v":""},{"$f":"PAGE5!M12","v":""},null,{"$f":"PAGE5!N12","v":""}]
[null,null,null,4,{"$f":"PAGE5!D13","v":0},{"$f":"PAGE5!E13","v":0},{"$f":"PAGE5!F13","v":0},null,{"$f":"PAGE5!G13","v":0},{"$f":"PAGE5!H13","v":0},{"$f":"PAGE5!I13","v":0},{"$f":"IF(PAGE5!J13=0, \"-\", PAGE5!J13)","v":"-"},{"$f":"IF(PAGE5!K13=0, \"-\", PAGE5!K13)","v":"-"},{"$f":"PAGE5!L13","v":""},{"$f":"PAGE5!M13","v":""},null,{"$f":"PAGE5!N13","v":""}]
[null,null,null,5,{"$f":"PAGE5!D14","v":0},{"$f":"PAGE5!E14","v":0},{"$f":"PAGE5!F14","v":0},null,{"$f":"PAGE5!G14","v":0},{"$f":"PAGE5!H14","v":0},{"$f":"PAGE5!I14","v":0},{"$f":"IF(PAGE5!J14=0, \"-\", PAGE5!J14)","v":"-"},{"$f":"IF(PAGE5!K14=0, \"-\", PAGE5!K14)","v":"-"},{"$f":"PAGE5!L14","v":""},{"$f":"PAGE5!M14","v":""},null,{"$f":"PAGE5!N14","v":""}]
[null,null,null,6,{"$f":"PAGE5!D15","v":0},{"$f":"PAGE5!E15","v":0},{"$f":"PAGE5!F15","v":0},null,{"$f":"PAGE5!G15","v":0},{"$f":"PAGE5!H15","v":0},{"$f":"PAGE5!I15","v":0},{"$f":"IF(PAGE5!J15=0, \"-\", PAGE5!J15)","v":"-"},{"$f":"IF(PAGE5!K15=0, \"-\", PAGE5!K15)","v":"-"},{"$f":"PAGE5!L15","v":""},{"$f":"PAGE5!M15","v":""},null,{"$f":"PAGE5!N15","v":""}]
[null,null,null,7,{"$f":"PAGE5!D16","v":0},{"$f":"PAGE5!E16","v":0},{"$f":"PAGE5!F16","v":0},null,{"$f":"PAGE5!G16","v":0},{"$f":"PAGE5!H16","v":0},{"$f":"PAGE5!I16","v":0},{"$f":"IF(PAGE5!J16=0, \"-\", PAGE5!J16)","v":"-"},{"$f":"IF(PAGE5!K16=0, \"-\", PAGE5!K16)","v":"-"},{"$f":"PAGE5!L16","v":""},{"$f":"PAGE5!M16","v":""},null,{"$f":"PAGE5!N16","v":""}]
[null,null,null,8,{"$f":"PAGE5!D17","v":0},{"$f":"PAGE5!E17","v":0},{"$f":"PAGE5!F17","v":0},null,{"$f":"PAGE5!G17","v":0},{"$f":"PAGE5!H17","v":0},{"$f":"PAGE5!I17","v":0},{"$f":"IF(PAGE5!J17=0, \"-\", PAGE5!J17)","v":"-"},{"$f":"IF(PAGE5!K17=0, \"-\", PAGE5!K17)","v":"-"},{"$f":"PAGE5!L17","v":""},{"$f":"PAGE5!M17","v":""},null,{"$f":"PAGE5!N17","v":""}]
[null,null,null,9,{"$f":"PAGE5!D18","v":0},{"$f":"PAGE5!E18","v":0},{"$f":"PAGE5!F18","v":0},null,{"$f":"PAGE5!G18","v":0},{"$f":"PAGE5!H18","v":0},{"$f":"PAGE5!I18","v":0},{"$f":"IF(PAGE5!J18=0, \"-\", PAGE5!J18)","v":"-"},{"$f":"IF(PAGE5!K18=0, \"-\", PAGE5!K18)","v":"-"},{"$f":"PAGE5!L18","v":""},{"$f":"PAGE5!M18","v":""},null,{"$f":"PAGE5!N18","v":""}]
[null,null,null,10,{"$f":"PAGE5!D19","v":0},{"$f":"PAGE5!E19","v":0},{"$f":"PAGE5!F19","v":0},null,{"$f":"PAGE5!G19","v":0},{"$f":"PAGE5!H19","v":0},{"$f":"PAGE5!I19","v":0},{"$f":"IF(PAGE5!J19=0, \"-\", PAGE5!J19)","v":"-"},{"$f":"IF(PAGE5!K19=0, \"-\", PAGE5!K19)","v":"-"},{"$f":"PAGE5!L19","v":""},{"$f":"PAGE5!M19","v":""},null,{"$f":"PAGE5!N19","v":""}]
[null,null,null,11,{"$f":"PAGE5!D20","v":0},{"$f":"PAGE5!E20","v":0},{"$f":"PAGE5!F20","v":0},null,{"$f":"PAGE5!G20","v":0},{"$f":"PAGE5!H20","v":0},{"$f":"PAGE5!I20","v":0},{"$f":"IF(PAGE5!J20=0, \"-\", PAGE5!J20)","v":"-"},{"$f":"IF(PAGE5!K20=0, \"-\", PAGE5!K20)","v":"-"},{"$f":"PAGE5!L20","v":""},{"$f":"PAGE5!M20","v":""},null,{"$f":"PAGE5!N20","v":""}]
[null,null,null,12,{"$f":"PAGE5!D21","v":0},{"$f":"PAGE5!E21","v":0},{"$f":"PAGE5!F21","v":0},null,{"$f":"PAGE5!G21","v":0},{"$f":"PAGE5!H21","v":0},{"$f":"PAGE5!I21","v":0},{"$f":"IF(PAGE5!J21=0, \"-\", PAGE5!J21)","v":"-"},{"$f":"IF(PAGE5!K21=0, \"-\", PAGE5!K21)","v":"-"},{"$f":"PAGE5!L21","v":""},{"$f":"PAGE5!M21","v":""},null,{"$f":"PAGE5!N21","v":""}]
[null,null,null,13,{"$f":"PAGE5!D22","v":0},{"$f":"PAGE5!E22","v":0},{"$f":"PAGE5!F22","v":0},null,{"$f":"PAGE5!G22","v":0},{"$f":"PAGE5!H22","v":0},{"$f":"PAGE5!I22","v":0},{"$f":"IF(PAGE5!J22=0, \"-\", PAGE5!J22)","v":"-"},{"$f":"IF(PAGE5!K22=0, \"-\", PAGE5!K22)","v":"-"},{"$f":"PAGE5!L22","v":""},{"$f":"PAGE5!M22","v":""},null,{"$f":"PAGE5!N22","v":""}]
[null,null,null,14,{"$f":"PAGE5!D23","v":0},{"$f":"PAGE5!E23","v":0},{"$f":"PAGE5!F23","v":0},null,{"$f":"PAGE5!G23","v":0},{"$f":"PAGE5!H23","v":0},{"$f":"PAGE5!I23","v":0},{"$f":"IF(PAGE5!J23=0, \"-\", PAGE5!J23)","v":"-"},{"$f":"IF(PAGE5!K23=0, \"-\", PAGE5!K23)","v":"-"},{"$f":"PAGE5!L23","v":""},{"$f":"PAGE5!M23","v":""},null,{"$f":"PAGE5!N23","v":""}]
[null,null,null,15,{"$f":"PAGE5!D24","v":0},{"$f":"PAGE5!E24","v":0},{"$f":"PAGE5!F24","v":0},null,{"$f":"PAGE5!G24","v":0},{"$f":"PAGE5!H24","v":0},{"$f":"PAGE5!I24","v":0},{"$f":"IF(PAGE5!J24=0, \"-\", PAGE5!J24)","v":"-"},{"$f":"IF(PAGE5!K24=0, \"-\", PAGE5!K24)","v":"-"},{"$f":"PAGE5!L24","v":""},{"$f":"PAGE5!M24","v":""},null,{"$f":"PAGE5!N24","v":""}]
[null,null,null,16,{"$f":"PAGE5!D25","v":0},{"$f":"PAGE5!E25","v":0},{"$f":"PAGE5!F25","v":0},null,{"$f":"PAGE5!G25","v":0},{"$f":"PAGE5!H25","v":0},{"$f":"PAGE5!I25","v":0},{"$f":"IF(PAGE5!J25=0, \"-\", PAGE5!J25)","v":"-"},{"$f":"IF(PAGE5!K25=0, \"-\", PAGE5!K25)","v":"-"},{"$f":"PAGE5!L25","v":""},{"$f":"PAGE5!M25","v":""},null,{"$f":"PAGE5!N25","v":""}]
[null,null,null,17,{"$f":"PAGE5!D26","v":0},{"$f":"PAGE5!E26","v":0},{"$f":"PAGE5!F26","v":0},null,{"$f":"PAGE5!G26","v":0},{"$f":"PAGE5!H26","v":0},{"$f":"PAGE5!I26","v":0},{"$f":"IF(PAGE5!J26=0, \"-\", PAGE5!J26)","v":"-"},{"$f":"IF(PAGE5!K26=0, \"-\", PAGE5!K26)","v":"-"},{"$f":"PAGE5!L26","v":""},{"$f":"PAGE5!M26","v":""},null,{"$f":"PAGE5!N26","v":""}]
[null,null,null,18,{"$f":"PAGE5!D27","v":0},{"$f":"PAGE5!E27","v":0},{"$f":"PAGE5!F27","v":0},null,{"$f":"PAGE5!G27","v":0},{"$f":"PAGE5!H27","v":0},{"$f":"PAGE5!I27","v":0},{"$f":"IF(PAGE5!J27=0, \"-\", PAGE5!J27)","v":"-"},{"$f":"IF(PAGE5!K27=0, \"-\", PAGE5!K27)","v":"-"},{"$f":"PAGE5!L27","v":""},{"$f":"PAGE5!M27","v":""},null,{"$f":"PAGE5!N27","v":""}]
[null,null,null,19,{"$f":"PAGE5!D28","v":0},{"$f":"PAGE5!E28","v":0},{"$f":"PAGE5!F28","v":0},null,{"$f":"PAGE5!G28","v":0},{"$f":"PAGE5!H28","v":0},{"$f":"PAGE5!I28","v":0},{"$f":"IF(PAGE5!J28=0, \"-\", PAGE5!J28)","v":"-"},{"$f":"IF(PAGE5!K28=0, \"-\", PAGE5!K28)","v":"-"},{"$f":"PAGE5!L28","v":""},{"$f":"PAGE5!M28","v":""},null,{"$f":"PAGE5!N28","v":""}]
[null,null,null,20,{"$f":"PAGE5!D29","v":0},{"$f":"PAGE5!E29","v":0},{"$f":"PAGE5!F29","v":0},null,{"$f":"PAGE5!G29","v":0},{"$f":"PAGE5!H29","v":0},{"$f":"PAGE5!I29","v":0},{"$f":"IF(PAGE5!J29=0, \"-\", PAGE5!J29)","v":"-"},{"$f":"IF(PAGE5!K29=0, \"-\", PAGE5!K29)","v":"-"},{"$f":"PAGE5!L29","v":""},{"$f":"PAGE5!M29","v":""},null,{"$f":"PAGE5!N29","v":""}]
[null,null,null,21,{"$f":"PAGE5!D30","v":0},{"$f":"PAGE5!E30","v":0},{"$f":"PAGE5!F30","v":0},null,{"$f":"PAGE5!G30","v":0},{"$f":"PAGE5!H30","v":0},{"$f":"PAGE5!I30","v":0},{"$f":"IF(PAGE5!J30=0, \"-\", PAGE5!J30)","v":"-"},{"$f":"IF(PAGE5!K30=0, \"-\", PAGE5!K30)","v":"-"},{"$f":"PAGE5!L30","v":""},{"$f":"PAGE5!M30","v":""},null,{"$f":"PAGE5!N30","v":""}]
[null,null,null,22,{"$f":"PAGE5!D31","v":0},{"$f":"PAGE5!E31","v":0},{"$f":"PAGE5!F31","v":0},null,{"$f":"PAGE5!G31","v":0},{"$f":"PAGE5!H31","v":0},{"$f":"PAGE5!I31","v":0},{"$f":"IF(PAGE5!J31=0, \"-\", PAGE5!J31)","v":"-"},{"$f":"IF(PAGE5!K31=0, \"-\", PAGE5!K31)","v":"-"},{"$f":"PAGE5!L31","v":""},{"$f":"PAGE5!M31","v":""},null,{"$f":"PAGE5!N31","v":""}]
[null,null,null,23,{"$f":"PAGE5!D32","v":0},{"$f":"PAGE5!E32","v":0},{"$f":"PAGE5!F32","v":0},null,{"$f":"PAGE5!G32","v":0},{"$f":"PAGE5!H32","v":0},{"$f":"PAGE5!I32","v":0},{"$f":"IF(PAGE5!J32=0, \"-\", PAGE5!J32)","v":"-"},{"$f":"IF(PAGE5!K32=0, \"-\", PAGE5!K32)","v":"-"},{"$f":"PAGE5!L32","v":""},{"$f":"PAGE5!M32","v":""},null,{"$f":"PAGE5!N32","v":""}]
[null,null,null,24,{"$f":"PAGE5!D33","v":0},{"$f":"PAGE5!E33","v":0},{"$f":"PAGE5!F33","v":0},null,{"$f":"PAGE5!G33","v":0},{"$f":"PAGE5!H33","v":0},{"$f":"PAGE5!I33","v":0},{"$f":"IF(PAGE5!J33=0, \"-\", PAGE5!J33)","v":"-"},{"$f":"IF(PAGE5!K33=0, \"-\", PAGE5!K33)","v":"-"},{"$f":"PAGE5!L33","v":""},{"$f":"PAGE5!M33","v":""},null,{"$f":"PAGE5!N33","v":""}]
[null,null,null,null,null,null,"Esse QDG não possui consumidores, pois funcionará apenas como QPGS.",null,null,null,null,null,null,null,null,null,{"$f":"IF(A1=TRUE,\"1\",\"\")","v":""}]
[null,null,null,null,null,null,"QD - PARCIAL 1",null,null,null,null,null,null,null,null,null,"QD-P1"]
[null,null,null,1,{"$f":"PAGE6!D10","v":0},{"$f":"PAGE6!E10","v":0},{"$f":"PAGE6!F10","v":0},null,{"$f":"PAGE6!G10","v":0},{"$f":"PAGE6!H10","v":0},{"$f":"PAGE6!I10","v":0},{"$f":"IF(PAGE6!J10=0, \"-\", PAGE6!J10)","v":"-"},{"$f":"IF(PAGE6!K10=0, \"-\", PAGE6!K10)","v":"-"},{"$f":"PAGE6!L10","v":""},{"$f":"PAGE6!M10","v":""},null,{"$f":"PAGE6!N10","v":""}]
[null,null,null,2,{"$f":"PAGE6!D11","v":0},{"$f":"PAGE6!E11","v":0},{"$f":"PAGE6!F11","v":0},null,{"$f":"PAGE6!G11","v":0},{"$f":"PAGE6!H11","v":0},{"$f":"PAGE6!I11","v":0},{"$f":"IF(PAGE6!J11=0, \"-\", PAGE6!J11)","v":"-"},{"$f":"IF(PAGE6!K11=0, \"-\", PAGE6!K11)","v":"-"},{"$f":"PAGE6!L11","v":""},{"$f":"PAGE6!M11","v":""},null,{"$f":"PAGE6!N11","v":""}]
[null,null,null,3,{"$f":"PAGE6!D12","v":0},{"$f":"PAGE6!E12","v":0},{"$f":"PAGE6!F12","v":0},null,{"$f":"PAGE6!G12","v":0},{"$f":"PAGE6!H12","v":0},{"$f":"PAGE6!I12","v":0},{"$f":"IF(PAGE6!J12=0, \"-\", PAGE6!J12)","v":"-"},{"$f":"IF(PAGE6!K12=0, \"-\", PAGE6!K12)","v":"-"},{"$f":"PAGE6!L12","v":""},{"$f":"PAGE6!M12","v":""},null,{"$f":"PAGE6!N12","v":""}]
[null,null,null,4,{"$f":"PAGE6!D13","v":0},{"$f":"PAGE6!E13","v":0},{"$f":"PAGE6!F13","v":0},null,{"$f":"PAGE6!G13","v":0},{"$f":"PAGE6!H13","v":0},{"$f":"PAGE6!I13","v":0},{"$f":"IF(PAGE6!J13=0, \"-\", PAGE6!J13)","v":"-"},{"$f":"IF(PAGE6!K13=0, \"-\", PAGE6!K13)","v":"-"},{"$f":"PAGE6!L13","v":""},{"$f":"PAGE6!M13","v":""},null,{"$f":"PAGE6!N13","v":""}]
[null,null,null,5,{"$f":"PAGE6!D14","v":0},{"$f":"PAGE6!E14","v":0},{"$f":"PAGE6!F14","v":0},null,{"$f":"PAGE6!G14","v":0},{"$f":"PAGE6!H14","v":0},{"$f":"PAGE6!I14","v":0},{"$f":"IF(PAGE6!J14=0, \"-\", PAGE6!J14)","v":"-"},{"$f":"IF(PAGE6!K14=0, \"-\", PAGE6!K14)","v":"-"},{"$f":"PAGE6!L14","v":""},{"$f":"PAGE6!M14","v":""},null,{"$f":"PAGE6!N14","v":""}]
[null,null,null,6,{"$f":"PAGE6!D15","v":0},{"$f":"PAGE6!E15","v":0},{"$f":"PAGE6!F15","v":0},null,{"$f":"PAGE6!G15","v":0},{"$f":"PAGE6!H15","v":0},{"$f":"PAGE6!I15","v":0},{"$f":"IF(PAGE6!J15=0, \"-\", PAGE6!J15)","v":"-"},{"$f":"IF(PAGE6!K15=0, \"-\", PAGE6!K15)","v":"-"},{"$f":"PAGE6!L15","v":""},{"$f":"PAGE6!M15","v":""},null,{"$f":"PAGE6!N15","v":""}]
[null,null,null,7,{"$f":"PAGE6!D16","v":0},{"$f":"PAGE6!E16","v":0},{"$f":"PAGE6!F16","v":0},null,{"$f":"PAGE6!G16","v":0},{"$f":"PAGE6!H16","v":0},{"$f":"PAGE6!I16","v":0},{"$f":"IF(PAGE6!J16=0, \"-\", PAGE6!J16)","v":"-"},{"$f":"IF(PAGE6!K16=0, \"-\", PAGE6!K16)","v":"-"},{"$f":"PAGE6!L16","v":""},{"$f":"PAGE6!M16","v":""},null,{"$f":"PAGE6!N16","v":""}]
[null,null,null,8,{"$f":"PAGE6!D17","v":0},{"$f":"PAGE6!E17","v":0},{"$f":"PAGE6!F17","v":0},null,{"$f":"PAGE6!G17","v":0},{"$f":"PAGE6!H17","v":0},{"$f":"PAGE6!I17","v":0},{"$f":"IF(PAGE6!J17=0, \"-\", PAGE6!J17)","v":"-"},{"$f":"IF(PAGE6!K17=0, \"-\", PAGE6!K17)","v":"-"},{"$f":"PAGE6!L17","v":""},{"$f":"PAGE6!M17","v":""},null,{"$f":"PAGE6!N17","v":""}]
[null,null,null,9,{"$f":"PAGE6!D18","v":0},{"$f":"PAGE6!E18","v":0},{"$f":"PAGE6!F18","v":0},null,{"$f":"PAGE6!G18","v":0},{"$f":"PAGE6!H18","v":0},{"$f":"PAGE6!I18","v":0},{"$f":"IF(PAGE6!J18=0, \"-\", PAGE6!J18)","v":"-"},{"$f":"IF(PAGE6!K18=0, \"-\", PAGE6!K18)","v":"-"},{"$f":"PAGE6!L18","v":""},{"$f":"PAGE6!M18","v":""},null,{"$f":"PAGE6!N18","v":""}]
[null,null,null,10,{"$f":"PAGE6!D19","v":0},{"$f":"PAGE6!E19","v":0},{"$f":"PAGE6!F19","v":0},null,{"$f":"PAGE6!G19","v":0},{"$f":"PAGE6!H19","v":0},{"$f":"PAGE6!I19","v":0},{"$f":"IF(PAGE6!J19=0, \"-\", PAGE6!J19)","v":"-"},{"$f":"IF(PAGE6!K19=0, \"-\", PAGE6!K19)","v":"-"},{"$f":"PAGE6!L19","v":""},{"$f":"PAGE6!M19","v":""},null,{"$f":"PAGE6!N19","v":""}]
[null,null,null,11,{"$f":"PAGE6!D20","v":0},{"$f":"PAGE6!E20","v":0},{"$f":"PAGE6!F20","v":0},null,{"$f":"PAGE6!G20","v":0},{"$f":"PAGE6!H20","v":0},{"$f":"PAGE6!I20","v":0},{"$f":"IF(PAGE6!J20=0, \"-\", PAGE6!J20)","v":"-"},{"$f":"IF(PAGE6!K20=0, \"-\", PAGE6!K20)","v":"-"},{"$f":"PAGE6!L20","v":""},{"$f":"PAGE6!M20","v":""},null,{"$f":"PAGE6!N20","v":""}]
[null,null,null,12,{"$f":"PAGE6!D21","v":0},{"$f":"PAGE6!E21","v":0},{"$f":"PAGE6!F21","v":0},null,{"$f":"PAGE6!G21","v":0},{"$f":"PAGE6!H21","v":0},{"$f":"PAGE6!I21","v":0},{"$f":"IF(PAGE6!J21=0, \"-\", PAGE6!J21)","v":"-"},{"$f":"IF(PAGE6!K21=0, \"-\", PAGE6!K21)","v":"-"},{"$f":"PAGE6!L21","v":""},{"$f":"PAGE6!M21","v":""},null,{"$f":"PAGE6!N21","v":""}]
[null,null,null,13,{"$f":"PAGE6!D22","v":0},{"$f":"PAGE6!E22","v":0},{"$f":"PAGE6!F22","v":0},null,{"$f":"PAGE6!G22","v":0},{"$f":"PAGE6!H22","v":0},{"$f":"PAGE6!I22","v":0},{"$f":"IF(PAGE6!J22=0, \"-\", PAGE6!J22)","v":"-"},{"$f":"IF(PAGE6!K22=0, \"-\", PAGE6!K22)","v":"-"},{"$f":"PAGE6!L22","v":""},{"$f":"PAGE6!M22","v":""},null,{"$f":"PAGE6!N22","v":""}]
[null,null,null,14,{"$f":"PAGE6!D23","v":0},{"$f":"PAGE6!E23","v":0},{"$f":"PAGE6!F23","v":0},null,{"$f":"PAGE6!G23","v":0},{"$f":"PAGE6!H23","v":0},{"$f":"PAGE6!I23","v":0},{"$f":"IF(PAGE6!J23=0, \"-\", PAGE6!J23)","v":"-"},{"$f":"IF(PAGE6!K23=0, \"-\", PAGE6!K23)","v":"-"},{"$f":"PAGE6!L23","v":""},{"$f":"PAGE6!M23","v":""},null,{"$f":"PAGE6!N23","v":""}]
[null,null,null,15,{"$f":"PAGE6!D24","v":0},{"$f":"PAGE6!E24","v":0},{"$f":"PAGE6!F24","v":0},null,{"$f":"PAGE6!G24","v":0},{"$f":"PAGE6!H24","v":0},{"$f":"PAGE6!I24","v":0},{"$f":"IF(PAGE6!J24=0, \"-\", PAGE6!J24)","v":"-"},{"$f":"IF(PAGE6!K24=0, \"-\", PAGE6!K24)","v":"-"},{"$f":"PAGE6!L24","v":""},{"$f":"PAGE6!M24","v":""},null,{"$f":"PAGE6!N24","v":""}]
[null,null,null,16,{"$f":"PAGE6!D25","v":0},{"$f":"PAGE6!E25","v":0},{"$f":"PAGE6!F25","v":0},null,{"$f":"PAGE6!G25","v":0},{"$f":"PAGE6!H25","v":0},{"$f":"PAGE6!I25","v":0},{"$f":"IF(PAGE6!J25=0, \"-\", PAGE6!J25)","v":"-"},{"$f":"IF(PAGE6!K25=0, \"-\", PAGE6!K25)","v":"-"},{"$f":"PAGE6!L25","v":""},{"$f":"PAGE6!M25","v":""},null,{"$f":"PAGE6!N25","v":""}]
[null,null,null,17,{"$f":"PAGE6!D26","v":0},{"$f":"PAGE6!E26","v":0},{"$f":"PAGE6!F26","v":0},null,{"$f":"PAGE6!G26","v":0},{"$f":"PAGE6!H26","v":0},{"$f":"PAGE6!I26","v":0},{"$f":"IF(PAGE6!J26=0, \"-\", PAGE6!J26)","v":"-"},{"$f":"IF(PAGE6!K26=0, \"-\", PAGE6!K26)","v":"-"},{"$f":"PAGE6!L26","v":""},{"$f":"PAGE6!M26","v":""},null,{"$f":"PAGE6!N26","v":""}]
[null,null,null,18,{"$f":"PAGE6!D27","v":0},{"$f":"PAGE6!E27","v":0},{"$f":"PAGE6!F27","v":0},null,{"$f":"PAGE6!G27","v":0},{"$f":"PAGE6!H27","v":0},{"$f":"PAGE6!I27","v":0},{"$f":"IF(PAGE6!J27=0, \"-\", PAGE6!J27)","v":"-"},{"$f":"IF(PAGE6!K27=0, \"-\", PAGE6!K27)","v":"-"},{"$f":"PAGE6!L27","v":""},{"$f":"PAGE6!M27","v":""},null,{"$f":"PAGE6!N27","v":""}]
[null,null,null,19,{"$f":"PAGE6!D28","v":0},{"$f":"PAGE6!E28","v":0},{"$f":"PAGE6!F28","v":0},null,{"$f":"PAGE6!G28","v":0},{"$f":"PAGE6!H28","v":0},{"$f":"PAGE6!I28","v":0},{"$f":"IF(PAGE6!J28=0, \"-\", PAGE6!J28)","v":"-"},{"$f":"IF(PAGE6!K28=0, \"-\", PAGE6!K28)","v":"-"},{"$f":"PAGE6!L28","v":""},{"$f":"PAGE6!M28","v":""},null,{"$f":"PAGE6!N28","v":""}]
[null,null,null,20,{"$f":"PAGE6!D29","v":0},{"$f":"PAGE6!E29","v":0},{"$f":"PAGE6!F29","v":0},null,{"$f":"PAGE6!G29","v":0},{"$f":"PAGE6!H29","v":0},{"$f":"PAGE6!I29","v":0},{"$f":"IF(PAGE6!J29=0, \"-\", PAGE6!J29)","v":"-"},{"$f":"IF(PAGE6!K29=0, \"-\", PAGE6!K29)","v":"-"},{"$f":"PAGE6!L29","v":""},{"$f":"PAGE6!M29","v":""},null,{"$f":"PAGE6!N29","v":""}]
[null,null,null,21,{"$f":"PAGE6!D30","v":0},{"$f":"PAGE6!E30","v":0},{"$f":"PAGE6!F30","v":0},null,{"$f":"PAGE6!G30","v":0},{"$f":"PAGE6!H30","v":0},{"$f":"PAGE6!I30","v":0},{"$f":"IF(PAGE6!J30=0, \"-\", PAGE6!J30)","v":"-"},{"$f":"IF(PAGE6!K30=0, \"-\", PAGE6!K30)","v":"-"},{"$f":"PAGE6!L30","v":""},{"$f":"PAGE6!M30","v":""},null,{"$f":"PAGE6!N30","v":""}]
[null,null,null,22,{"$f":"PAGE6!D31","v":0},{"$f":"PAGE6!E31","v":0},{"$f":"PAGE6!F31","v":0},null,{"$f":"PAGE6!G31","v":0},{"$f":"PAGE6!H31","v":0},{"$f":"PAGE6!I31","v":0},{"$f":"IF(PAGE6!J31=0, \"-\", PAGE6!J31)","v":"-"},{"$f":"IF(PAGE6!K31=0, \"-\", PAGE6!K31)","v":"-"},{"$f":"PAGE6!L31","v":""},{"$f":"PAGE6!M31","v":""},null,{"$f":"PAGE6!N31","v":""}]
[null,null,null,23,{"$f":"PAGE6!D32","v":0},{"$f":"PAGE6!E32","v":0},{"$f":"PAGE6!F32","v":0},null,{"$f":"PAGE6!G32","v":0},{"$f":"PAGE6!H32","v":0},{"$f":"PAGE6!I32","v":0},{"$f":"IF(PAGE6!J32=0, \"-\", PAGE6!J32)","v":"-"},{"$f":"IF(PAGE6!K32=0, \"-\", PAGE6!K32)","v":"-"},{"$f":"PAGE6!L32","v":""},{"$f":"PAGE6!M32","v":""},null,{"$f":"PAGE6!N32","v":""}]
[null,null,null,24,{"$f":"PAGE6!D33","v":0},{"$f":"PAGE6!E33","v":0},{"$f":"PAGE6!F33","v":0},null,{"$f":"PAGE6!G33","v":0},{"$f":"PAGE6!H33","v":0},{"$f":"PAGE6!I33","v":0},{"$f":"IF(PAGE6!J33=0, \"-\", PAGE6!J33)","v":"-"},{"$f":"IF(PAGE6!K33=0, \"-\", PAGE6!K33)","v":"-"},{"$f":"PAGE6!L33","v":""},{"$f":"PAGE6!M33","v":""},null,{"$f":"PAGE6!N33","v":""}]
[null,null,null,null,null,null,"QD - PARCIAL 2",null,null,null,null,null,null,null,null,null,"QD-P2"]
[null,null,null,1,{"$f":"PAGE7!D10","v":0},{"$f":"PAGE7!E10","v":0},{"$f":"PAGE7!F10","v":0},null,{"$f":"PAGE7!G10","v":0},{"$f":"PAGE7!H10","v":0},{"$f":"PAGE7!I10","v":0},{"$f":"IF(PAGE7!J10=0, \"-\", PAGE7!J10)","v":"-"},{"$f":"IF(PAGE7!K10=0, \"-\", PAGE7!K10)","v":"-"},{"$f":"PAGE7!L10","v":""},{"$f":"PAGE7!M10","v":""},null,{"$f":"PAGE7!N10","v":""}]
[null,null,null,2,{"$f":"PAGE7!D11","v":0},{"$f":"PAGE7!E11","v":0},{"$f":"PAGE7!F11","v":0},null,{"$f":"PAGE7!G11","v":0},{"$f":"PAGE7!H11","v":0},{"$f":"PAGE7!I11","v":0},{"$f":"IF(PAGE7!J11=0, \"-\", PAGE7!J11)","v":"-"},{"$f":"IF(PAGE7!K11=0, \"-\", PAGE7!K11)","v":"-"},{"$f":"PAGE7!L11","v":""},{"$f":"PAGE7!M11","v":""},null,{"$f":"PAGE7!N11","v":""}]
[null,null,null,3,{"$f":"PAGE7!D12","v":0},{"$f":"PAGE7!E12","v":0},{"$f":"PAGE7!F12","v":0},null,{"$f":"PAGE7!G12","v":0},{"$f":"PAGE7!H12","v":0},{"$f":"PAGE7!I12","v":0},{"$f":"IF(PAGE7!J12=0, \"-\", PAGE7!J12)","v":"-"},{"$f":"IF(PAGE7!K12=0, \"-\", PAGE7!K12)","v":"-"},{"$f":"PAGE7!L12","v":""},{"$f":"PAGE7!M12","v":""},null,{"$f":"PAGE7!N12","v":""}]
[null,null,null,4,{"$f":"PAGE7!D13","v":0},{"$f":"PAGE7!E13","v":0},{"$f":"PAGE7!F13","v":0},null,{"$f":"PAGE7!G13","v":0},{"$f":"PAGE7!H13","v":0},{"$f":"PAGE7!I13","v":0},{"$f":"IF(PAGE7!J13=0, \"-\", PAGE7!J13)","v":"-"},{"$f":"IF(PAGE7!K13=0, \"-\", PAGE7!K13)","v":"-"},{"$f":"PAGE7!L13","v":""},{"$f":"PAGE7!M13","v":""},null,{"$f":"PAGE7!N13","v":""}]
[null,null,null,5,{"$f":"PAGE7!D14","v":0},{"$f":"PAGE7!E14","v":0},{"$f":"PAGE7!F14","v":0},null,{"$f":"PAGE7!G14","v":0},{"$f":"PAGE7!H14","v":0},{"$f":"PAGE7!I14","v":0},{"$f":"IF(PAGE7!J14=0, \"-\", PAGE7!J14)","v":"-"},{"$f":"IF(PAGE7!K14=0, \"-\", PAGE7!K14)","v":"-"},{"$f":"PAGE7!L14","v":""},{"$f":"PAGE7!M14","v":""},null,{"$f":"PAGE7!N14","v":""}]
[null,null,null,6,{"$f":"PAGE7!D15","v":0},{"$f":"PAGE7!E15","v":0},{"$f":"PAGE7!F15","v":0},null,{"$f":"PAGE7!G15","v":0},{"$f":"PAGE7!H15","v":0},{"$f":"PAGE7!I15","v":0},{"$f":"IF(PAGE7!J15=0, \"-\", PAGE7!J15)","v":"-"},{"$f":"IF(PAGE7!K15=0, \"-\", PAGE7!K15)","v":"-"},{"$f":"PAGE7!L15","v":""},{"$f":"PAGE7!M15","v":""},null,{"$f":"PAGE7!N15","v":""}]
[null,null,null,7,{"$f":"PAGE7!D16","v":0},{"$f":"PAGE7!E16","v":0},{"$f":"PAGE7!F16","v":0},null,{"$f":"PAGE7!G16","v":0},{"$f":"PAGE7!H16","v":0},{"$f":"PAGE7!I16","v":0},{"$f":"IF(PAGE7!J16=0, \"-\", PAGE7!J16)","v":"-"},{"$f":"IF(PAGE7!K16=0, \"-\", PAGE7!K16)","v":"-"},{"$f":"PAGE7!L16","v":""},{"$f":"PAGE7!M16","v":""},null,{"$f":"PAGE7!N16","v":""}]
[null,null,null,8,{"$f":"PAGE7!D17","v":0},{"$f":"PAGE7!E17","v":0},{"$f":"PAGE7!F17","v":0},null,{"$f":"PAGE7!G17","v":0},{"$f":"PAGE7!H17","v":0},{"$f":"PAGE7!I17","v":0},{"$f":"IF(PAGE7!J17=0, \"-\", PAGE7!J17)","v":"-"},{"$f":"IF(PAGE7!K17=0, \"-\", PAGE7!K17)","v":"-"},{"$f":"PAGE7!L17","v":""},{"$f":"PAGE7!M17","v":""},null,{"$f":"PAGE7!N17","v":""}]
[null,null,null,9,{"$f":"PAGE7!D18","v":0},{"$f":"PAGE7!E18","v":0},{"$f":"PAGE7!F18","v":0},null,{"$f":"PAGE7!G18","v":0},{"$f":"PAGE7!H18","v":0},{"$f":"PAGE7!I18","v":0},{"$f":"IF(PAGE7!J18=0, \"-\", PAGE7!J18)","v":"-"},{"$f":"IF(PAGE7!K18=0, \"-\", PAGE7!K18)","v":"-"},{"$f":"PAGE7!L18","v":""},{"$f":"PAGE7!M18","v":""},null,{"$f":"PAGE7!N18","v":""}]
[null,null,null,10,{"$f":"PAGE7!D19","v":0},{"$f":"PAGE7!E19","v":0},{"$f":"PAGE7!F19","v":0},null,{"$f":"PAGE7!G19","v":0},{"$f":"PAGE7!H19","v":0},{"$f":"PAGE7!I19","v":0},{"$f":"IF(PAGE7!J19=0, \"-\", PAGE7!J19)","v":"-"},{"$f":"IF(PAGE7!K19=0, \"-\", PAGE7!K19)","v":"-"},{"$f":"PAGE7!L19","v":""},{"$f":"PAGE7!M19","v":""},null,{"$f":"PAGE7!N19","v":""}]
[null,null,null,11,{"$f":"PAGE7!D20","v":0},{"$f":"PAGE7!E20","v":0},{"$f":"PAGE7!F20","v":0},null,{"$f":"PAGE7!G20","v":0},{"$f":"PAGE7!H20","v":0},{"$f":"PAGE7!I20","v":0},{"$f":"IF(PAGE7!J20=0, \"-\", PAGE7!J20)","v":"-"},{"$f":"IF(PAGE7!K20=0, \"-\", PAGE7!K20)","v":"-"},{"$f":"PAGE7!L20","v":""},{"$f":"PAGE7!M20","v":""},null,{"$f":"PAGE7!N20","v":""}]
[null,null,null,12,{"$f":"PAGE7!D21","v":0},{"$f":"PAGE7!E21","v":0},{"$f":"PAGE7!F21","v":0},null,{"$f":"PAGE7!G21","v":0},{"$f":"PAGE7!H21","v":0},{"$f":"PAGE7!I21","v":0},{"$f":"IF(PAGE7!J21=0, \"-\", PAGE7!J21)","v":"-"},{"$f":"IF(PAGE7!K21=0, \"-\", PAGE7!K21)","v":"-"},{"$f":"PAGE7!L21","v":""},{"$f":"PAGE7!M21","v":""},null,{"$f":"PAGE7!N21","v":""}]
[null,null,null,13,{"$f":"PAGE7!D22","v":0},{"$f":"PAGE7!E22","v":0},{"$f":"PAGE7!F22","v":0},null,{"$f":"PAGE7!G22","v":0},{"$f":"PAGE7!H22","v":0},{"$f":"PAGE7!I22","v":0},{"$f":"IF(PAGE7!J22=0, \"-\", PAGE7!J22)","v":"-"},{"$f":"IF(PAGE7!K22=0, \"-\", PAGE7!K22)","v":"-"},{"$f":"PAGE7!L22","v":""},{"$f":"PAGE7!M22","v":""},null,{"$f":"PAGE7!N22","v":""}]
[null,null,null,14,{"$f":"PAGE7!D23","v":0},{"$f":"PAGE7!E23","v":0},{"$f":"PAGE7!F23","v":0},null,{"$f":"PAGE7!G23","v":0},{"$f":"PAGE7!H23","v":0},{"$f":"PAGE7!I23","v":0},{"$f":"IF(PAGE7!J23=0, \"-\", PAGE7!J23)","v":"-"},{"$f":"IF(PAGE7!K23=0, \"-\", PAGE7!K23)","v":"-"},{"$f":"PAGE7!L23","v":""},{"$f":"PAGE7!M23","v":""},null,{"$f":"PAGE7!N23","v":""}]
[null,null,null,15,{"$f":"PAGE7!D24","v":0},{"$f":"PAGE7!E24","v":0},{"$f":"PAGE7!F24","v":0},null,{"$f":"PAGE7!G24","v":0},{"$f":"PAGE7!H24","v":0},{"$f":"PAGE7!I24","v":0},{"$f":"IF(PAGE7!J24=0, \"-\", PAGE7!J24)","v":"-"},{"$f":"IF(PAGE7!K24=0, \"-\", PAGE7!K24)","v":"-"},{"$f":"PAGE7!L24","v":""},{"$f":"PAGE7!M24","v":""},null,{"$f":"PAGE7!N24","v":""}]
[null,null,null,16,{"$f":"PAGE7!D25","v":0},{"$f":"PAGE7!E25","v":0},{"$f":"PAGE7!F25","v":0},null,{"$f":"PAGE7!G25","v":0},{"$f":"PAGE7!H25","v":0},{"$f":"PAGE7!I25","v":0},{"$f":"IF(PAGE7!J25=0, \"-\", PAGE7!J25)","v":"-"},{"$f":"IF(PAGE7!K25=0, \"-\", PAGE7!K25)","v":"-"},{"$f":"PAGE7!L25","v":""},{"$f":"PAGE7!M25","v":""},null,{"$f":"PAGE7!N25","v":""}]
[null,null,null,17,{"$f":"PAGE7!D26","v":0},{"$f":"PAGE7!E26","v":0},{"$f":"PAGE7!F26","v":0},null,{"$f":"PAGE7!G26","v":0},{"$f":"PAGE7!H26","v":0},{"$f":"PAGE7!I26","v":0},{"$f":"IF(PAGE7!J26=0, \"-\", PAGE7!J26)","v":"-"},{"$f":"IF(PAGE7!K26=0, \"-\", PAGE7!K26)","v":"-"},{"$f":"PAGE7!L26","v":""},{"$f":"PAGE7!M26","v":""},null,{"$f":"PAGE7!N26","v":""}]
[null,null,null,18,{"$f":"PAGE7!D27","v":0},{"$f":"PAGE7!E27","v":0},{"$f":"PAGE7!F27","v":0},null,{"$f":"PAGE7!G27","v":0},{"$f":"PAGE7!H27","v":0},{"$f":"PAGE7!I27","v":0},{"$f":"IF(PAGE7!J27=0, \"-\", PAGE7!J27)","v":"-"},{"$f":"IF(PAGE7!K27=0, \"-\", PAGE7!K27)","v":"-"},{"$f":"PAGE7!L27","v":""},{"$f":"PAGE7!M27","v":""},null,{"$f":"PAGE7!N27","v":""}]
[null,null,null,19,{"$f":"PAGE7!D28","v":0},{"$f":"PAGE7!E28","v":0},{"$f":"PAGE7!F28","v":0},null,{"$f":"PAGE7!G28","v":0},{"$f":"PAGE7!H28","v":0},{"$f":"PAGE7!I28","v":0},{"$f":"IF(PAGE7!J28=0, \"-\", PAGE7!J28)","v":"-"},{"$f":"IF(PAGE7!K28=0, \"-\", PAGE7!K28)","v":"-"},{"$f":"PAGE7!L28","v":""},{"$f":"PAGE7!M28","v":""},null,{"$f":"PAGE7!N28","v":""}]
[null,null,null,20,{"$f":"PAGE7!D29","v":0},{"$f":"PAGE7!E29","v":0},{"$f":"PAGE7!F29","v":0},null,{"$f":"PAGE7!G29","v":0},{"$f":"PAGE7!H29","v":0},{"$f":"PAGE7!I29","v":0},{"$f":"IF(PAGE7!J29=0, \"-\", PAGE7!J29)","v":"-"},{"$f":"IF(PAGE7!K29=0, \"-\", PAGE7!K29)","v":"-"},{"$f":"PAGE7!L29","v":""},{"$f":"PAGE7!M29","v":""},null,{"$f":"PAGE7!N29","v":""}]
[null,null,null,21,{"$f":"PAGE7!D30","v":0},{"$f":"PAGE7!E30","v":0},{"$f":"PAGE7!F30","v":0},null,{"$f":"PAGE7!G30","v":0},{"$f":"PAGE7!H30","v":0},{"$f":"PAGE7!I30","v":0},{"$f":"IF(PAGE7!J30=0, \"-\", PAGE7!J30)","v":"-"},{"$f":"IF(PAGE7!K30=0, \"-\", PAGE7!K30)","v":"-"},{"$f":"PAGE7!L30","v":""},{"$f":"PAGE7!M30","v":""},null,{"$f":"PAGE7!N30","v":""}]
[null,null,null,22,{"$f":"PAGE7!D31","v":0},{"$f":"PAGE7!E31","v":0},{"$f":"PAGE7!F31","v":0},null,{"$f":"PAGE7!G31","v":0},{"$f":"PAGE7!H31","v":0},{"$f":"PAGE7!I31","v":0},{"$f":"IF(PAGE7!J31=0, \"-\", PAGE7!J31)","v":"-"},{"$f":"IF(PAGE7!K31=0, \"-\", PAGE7!K31)","v":"-"},{"$f":"PAGE7!L31","v":""},{"$f":"PAGE7!M31","v":""},null,{"$f":"PAGE7!N31","v":""}]
[null,null,null,23,{"$f":"PAGE7!D32","v":0},{"$f":"PAGE7!E32","v":0},{"$f":"PAGE7!F32","v":0},null,{"$f":"PAGE7!G32","v":0},{"$f":"PAGE7!H32","v":0},{"$f":"PAGE7!I32","v":0},{"$f":"IF(PAGE7!J32=0, \"-\", PAGE7!J32)","v":"-"},{"$f":"IF(PAGE7!K32=0, \"-\", PAGE7!K32)","v":"-"},{"$f":"PAGE7!L32","v":""},{"$f":"PAGE7!M32","v":""},null,{"$f":"PAGE7!N32","v":""}]
[null,null,null,24,{"$f":"PAGE7!D33","v":0},{"$f":"PAGE7!E33","v":0},{"$f":"PAGE7!F33","v":0},null,{"$f":"PAGE7!G33","v":0},{"$f":"PAGE7!H33","v":0},{"$f":"PAGE7!I33","v":0},{"$f":"IF(PAGE7!J33=0, \"-\", PAGE7!J33)","v":"-"},{"$f":"IF(PAGE7!K33=0, \"-\", PAGE7!K33)","v":"-"},{"$f":"PAGE7!L33","v":""},{"$f":"PAGE7!M33","v":""},null,{"$f":"PAGE7!N33","v":""}]
[null,null,null,null,null,null,"QD - PARCIAL 3",null,null,null,null,null,null,null,null,null,"QD-P3"]
[null,null,null,1,{"$f":"PAGE8!D10","v":0},{"$f":"PAGE8!E10","v":"BLOCO"},{"$f":"PAGE8!F10","v":"Demanda"},null,{"$f":"PAGE8!G10","v":"Disjuntor"},{"$f":"PAGE8!H10","v":"Barramento"},{"$f":"PAGE8!I10","v":"Circuitos"},{"$f":"IF(PAGE8!J10=0, \"-\", PAGE8!J10)","v":"Ramal"},{"$f":"IF(PAGE8!K10=0, \"-\", PAGE8!K10)","v":"-"},{"$f":"PAGE8!L10","v":0},{"$f":"PAGE8!M10","v":0},null,{"$f":"PAGE8!N10","v":0}]
[null,null,null,2,{"$f":"PAGE8!D11","v":0},{"$f":"PAGE8!E11","v":0},{"$f":"PAGE8!F11","v":0},null,{"$f":"PAGE8!G11","v":""},{"$f":"PAGE8!H11","v":""},{"$f":"PAGE8!I11","v":""},{"$f":"IF(PAGE8!J11=0, \"-\", PAGE8!J11)","v":""},{"$f":"IF(PAGE8!K11=0, \"-\", PAGE8!K11)","v":"-"},{"$f":"PAGE8!L11","v":0},{"$f":"PAGE8!M11","v":0},null,{"$f":"PAGE8!N11","v":0}]
[null,null,null,3,{"$f":"PAGE8!D12","v":0},{"$f":"PAGE8!E12","v":0},{"$f":"PAGE8!F12","v":0},null,{"$f":"PAGE8!G12","v":""},{"$f":"PAGE8!H12","v":""},{"$f":"PAGE8!I12","v":""},{"$f":"IF(PAGE8!J12=0, \"-\", PAGE8!J12)","v":""},{"$f":"IF(PAGE8!K12=0, \"-\", PAGE8!K12)","v":"-"},{"$f":"PAGE8!L12","v":0},{"$f":"PAGE8!M12","v":0},null,{"$f":"PAGE8!N12","v":0}]
[null,null,null,4,{"$f":"PAGE8!D13","v":0},{"$f":"PAGE8!E13","v":0},{"$f":"PAGE8!F13","v":0},null,{"$f":"PAGE8!G13","v":""},{"$f":"PAGE8!H13","v":""},{"$f":"PAGE8!I13","v":""},{"$f":"IF(PAGE8!J13=0, \"-\", PAGE8!J13)","v":""},{"$f":"IF(PAGE8!K13=0, \"-\", PAGE8!K13)","v":"-"},{"$f":"PAGE8!L13","v":0},{"$f":"PAGE8!M13","v":0},null,{"$f":"PAGE8!N13","v":0}]
[null,null,null,5,{"$f":"PAGE8!D14","v":0},{"$f":"PAGE8!E14","v":0},{"$f":"PAGE8!F14","v":0},null,{"$f":"PAGE8!G14","v":""},{"$f":"PAGE8!H14","v":""},{"$f":"PAGE8!I14","v":""},{"$f":"IF(PAGE8!J14=0, \"-\", PAGE8!J14)","v":""},{"$f":"IF(PAGE8!K14=0, \"-\", PAGE8!K14)","v":"-"},{"$f":"PAGE8!L14","v":0},{"$f":"PAGE8!M14","v":0},null,{"$f":"PAGE8!N14","v":0}]
[null,null,null,6,{"$f":"PAGE8!D15","v":0},{"$f":"PAGE8!E15","v":0},{"$f":"PAGE8!F15","v":0},null,{"$f":"PAGE8!G15","v":""},{"$f":"PAGE8!H15","v":""},{"$f":"PAGE8!I15","v":""},{"$f":"IF(PAGE8!J15=0, \"-\", PAGE8!J15)","v":""},{"$f":"IF(PAGE8!K15=0, \"-\", PAGE8!K15)","v":"-"},{"$f":"PAGE8!L15","v":0},{"$f":"PAGE8!M15","v":0},null,{"$f":"PAGE8!N15","v":0}]
[null,null,null,7,{"$f":"PAGE8!D16","v":0},{"$f":"PAGE8!E16","v":0},{"$f":"PAGE8!F16","v":0},null,{"$f":"PAGE8!G16","v":""},{"$f":"PAGE8!H16","v":""},{"$f":"PAGE8!I16","v":""},{"$f":"IF(PAGE8!J16=0, \"-\", PAGE8!J16)","v":""},{"$f":"IF(PAGE8!K16=0, \"-\", PAGE8!K16)","v":"-"},{"$f":"PAGE8!L16","v":0},{"$f":"PAGE8!M16","v":0},null,{"$f":"PAGE8!N16","v":0}]
[null,null,null,8,{"$f":"PAGE8!D17","v":0},{"$f":"PAGE8!E17","v":0},{"$f":"PAGE8!F17","v":0},null,{"$f":"PAGE8!G17","v":0},{"$f":"PAGE8!H17","v":0},{"$f":"PAGE8!I17","v":0},{"$f":"IF(PAGE8!J17=0, \"-\", PAGE8!J17)","v":"-"},{"$f":"IF(PAGE8!K17=0, \"-\", PAGE8!K17)","v":"-"},{"$f":"PAGE8!L17","v":0},{"$f":"PAGE8!M17","v":0},null,{"$f":"PAGE8!N17","v":0}]
[null,null,null,9,{"$f":"PAGE8!D18","v":0},{"$f":"PAGE8!E18","v":0},{"$f":"PAGE8!F18","v":0},null,{"$f":"PAGE8!G18","v":0},{"$f":"PAGE8!H18","v":0},{"$f":"PAGE8!I18","v":0},{"$f":"IF(PAGE8!J18=0, \"-\", PAGE8!J18)","v":"-"},{"$f":"IF(PAGE8!K18=0, \"-\", PAGE8!K18)","v":"-"},{"$f":"PAGE8!L18","v":0},{"$f":"PAGE8!M18","v":0},null,{"$f":"PAGE8!N18","v":0}]
[null,null,null,10,{"$f":"PAGE8!D19","v":0},{"$f":"PAGE8!E19","v":0},{"$f":"PAGE8!F19","v":"Demanda CONDOMÍNIO - Carga Instalada"},null,{"$f":"PAGE8!G19","v":0},{"$f":"PAGE8!H19","v":0},{"$f":"PAGE8!I19","v":0},{"$f":"IF(PAGE8!J19=0, \"-\", PAGE8!J19)","v":"-"},{"$f":"IF(PAGE8!K19=0, \"-\", PAGE8!K19)","v":"-"},{"$f":"PAGE8!L19","v":0},{"$f":"PAGE8!M19","v":0},null,{"$f":"PAGE8!N19","v":0}]
[null,null,null,11,{"$f":"PAGE8!D20","v":"Dem."},{"$f":"PAGE8!E20","v":0},{"$f":"PAGE8!F20","v":"Parcela a"},null,{"$f":"PAGE8!G20","v":0},{"$f":"PAGE8!H20","v":0},{"$f":"PAGE8!I20","v":"kVA"},{"$f":"IF(PAGE8!J20=0, \"-\", PAGE8!J20)","v":"Ds"},{"$f":"IF(PAGE8!K20=0, \"-\", PAGE8!K20)","v":"-"},{"$f":"PAGE8!L20","v":0},{"$f":"PAGE8!M20","v":0},null,{"$f":"PAGE8!N20","v":0}]
[null,null,null,12,{"$f":"PAGE8!D21","v":0},{"$f":"PAGE8!E21","v":0},{"$f":"PAGE8!F21","v":"Pot (kVA)"},null,{"$f":"PAGE8!G21","v":"Fd"},{"$f":"PAGE8!H21","v":"Demanda"},{"$f":"PAGE8!I21","v":0},{"$f":"IF(PAGE8!J21=0, \"-\", PAGE8!J21)","v":"-"},{"$f":"IF(PAGE8!K21=0, \"-\", PAGE8!K21)","v":"-"},{"$f":"PAGE8!L21","v":0},{"$f":"PAGE8!M21","v":0},null,{"$f":"PAGE8!N21","v":0}]
[null,null,null,13,{"$f":"PAGE8!D22","v":0},{"$f":"PAGE8!E22","v":0},{"$f":"PAGE8!F22","v":0},null,{"$f":"PAGE8!G22","v":0},{"$f":"PAGE8!H22","v":0},{"$f":"PAGE8!I22","v":0},{"$f":"IF(PAGE8!J22=0, \"-\", PAGE8!J22)","v":"-"},{"$f":"IF(PAGE8!K22=0, \"-\", PAGE8!K22)","v":"-"},{"$f":"PAGE8!L22","v":0},{"$f":"PAGE8!M22","v":0},null,{"$f":"PAGE8!N22","v":0}]
[null,null,null,14,{"$f":"PAGE8!D23","v":0},{"$f":"PAGE8!E23","v":0},{"$f":"PAGE8!F23","v":0},null,{"$f":"PAGE8!G23","v":0},{"$f":"PAGE8!H23","v":0},{"$f":"PAGE8!I23","v":0},{"$f":"IF(PAGE8!J23=0, \"-\", PAGE8!J23)","v":"CI"},{"$f":"IF(PAGE8!K23=0, \"-\", PAGE8!K23)","v":"-"},{"$f":"PAGE8!L23","v":0},{"$f":"PAGE8!M23","v":0},null,{"$f":"PAGE8!N23","v":0}]
[null,null,null,15,{"$f":"PAGE8!D24","v":0},{"$f":"PAGE8!E24","v":0},{"$f":"PAGE8!F24","v":"Parcela b"},null,{"$f":"PAGE8!G24","v":0},{"$f":"PAGE8!H24","v":0},{"$f":"PAGE8!I24","v":"kVA"},{"$f":"IF(PAGE8!J24=0, \"-\", PAGE8!J24)","v":"Caixa"},{"$f":"IF(PAGE8!K24=0, \"-\", PAGE8!K24)","v":"-"},{"$f":"PAGE8!L24","v":0},{"$f":"PAGE8!M24","v":0},null,{"$f":"PAGE8!N24","v":0}]
[null,null,null,16,{"$f":"PAGE8!D25","v":0},{"$f":"PAGE8!E25","v":0},{"$f":"PAGE8!F25","v":"Pot (kVA)"},null,{"$f":"PAGE8!G25","v":"Qtd"},{"$f":"PAGE8!H25","v":"Demanda"},{"$f":"PAGE8!I25","v":"Fd"},{"$f":"IF(PAGE8!J25=0, \"-\", PAGE8!J25)","v":""},{"$f":"IF(PAGE8!K25=0, \"-\", PAGE8!K25)","v":"-"},{"$f":"PAGE8!L25","v":0},{"$f":"PAGE8!M25","v":0},null,{"$f":"PAGE8!N25","v":0}]
[null,null,null,17,{"$f":"PAGE8!D26","v":0},{"$f":"PAGE8!E26","v":0},{"$f":"PAGE8!F26","v":0},null,{"$f":"PAGE8!G26","v":0},{"$f":"PAGE8!H26","v":0},{"$f":"PAGE8!I26","v":0},{"$f":"IF(PAGE8!J26=0, \"-\", PAGE8!J26)","v":"-"},{"$f":"IF(PAGE8!K26=0, \"-\", PAGE8!K26)","v":"-"},{"$f":"PAGE8!L26","v":0},{"$f":"PAGE8!M26","v":0},null,{"$f":"PAGE8!N26","v":0}]
[null,null,null,18,{"$f":"PAGE8!D27","v":0},{"$f":"PAGE8!E27","v":0},{"$f":"PAGE8!F27","v":0},null,{"$f":"PAGE8!G27","v":0},{"$f":"PAGE8!H27","v":0},{"$f":"PAGE8!I27","v":0},{"$f":"IF(PAGE8!J27=0, \"-\", PAGE8!J27)","v":"-"},{"$f":"IF(PAGE8!K27=0, \"-\", PAGE8!K27)","v":"-"},{"$f":"PAGE8!L27","v":0},{"$f":"PAGE8!M27","v":0},null,{"$f":"PAGE8!N27","v":0}]
[null,null,null,19,{"$f":"PAGE8!D28","v":0},{"$f":"PAGE8!E28","v":0},{"$f":"PAGE8!F28","v":"Parcela f"},null,{"$f":"PAGE8!G28","v":0},{"$f":"PAGE8!H28","v":0},{"$f":"PAGE8!I28","v":"kVA"},{"$f":"IF(PAGE8!J28=0, \"-\", PAGE8!J28)","v":"-"},{"$f":"IF(PAGE8!K28=0, \"-\", PAGE8!K28)","v":"-"},{"$f":"PAGE8!L28","v":0},{"$f":"PAGE8!M28","v":0},null,{"$f":"PAGE8!N28","v":0}]
[null,null,null,20,{"$f":"PAGE8!D29","v":0},{"$f":"PAGE8!E29","v":0},{"$f":"PAGE8!F29","v":"Pot (kVA)"},null,{"$f":"PAGE8!G29","v":"Qtd"},{"$f":"PAGE8!H29","v":"Demanda"},{"$f":"PAGE8!I29","v":"Fd"},{"$f":"IF(PAGE8!J29=0, \"-\", PAGE8!J29)","v":"-"},{"$f":"IF(PAGE8!K29=0, \"-\", PAGE8!K29)","v":"-"},{"$f":"PAGE8!L29","v":0},{"$f":"PAGE8!M29","v":0},null,{"$f":"PAGE8!N29","v":0}]
[null,null,null,21,{"$f":"PAGE8!D30","v":0},{"$f":"PAGE8!E30","v":0},{"$f":"PAGE8!F30","v":0},null,{"$f":"PAGE8!G30","v":0},{"$f":"PAGE8!H30","v":0},{"$f":"PAGE8!I30","v":0},{"$f":"IF(PAGE8!J30=0, \"-\", PAGE8!J30)","v":"-"},{"$f":"IF(PAGE8!K30=0, \"-\", PAGE8!K30)","v":"-"},{"$f":"PAGE8!L30","v":0},{"$f":"PAGE8!M30","v":0},null,{"$f":"PAGE8!N30","v":0}]
[null,null,null,22,{"$f":"PAGE8!D31","v":0},{"$f":"PAGE8!E31","v":0},{"$f":"PAGE8!F31","v":0},null,{"$f":"PAGE8!G31","v":0},{"$f":"PAGE8!H31","v":0},{"$f":"PAGE8!I31","v":0},{"$f":"IF(PAGE8!J31=0, \"-\", PAGE8!J31)","v":"-"},{"$f":"IF(PAGE8!K31=0, \"-\", PAGE8!K31)","v":"-"},{"$f":"PAGE8!L31","v":0},{"$f":"PAGE8!M31","v":0},null,{"$f":"PAGE8!N31","v":0}]
[null,null,null,23,{"$f":"PAGE8!D32","v":0},{"$f":"PAGE8!E32","v":0},{"$f":"PAGE8!F32","v":"Parcela g"},null,{"$f":"PAGE8!G32","v":0},{"$f":"PAGE8!H32","v":0},{"$f":"PAGE8!I32","v":"kVA"},{"$f":"IF(PAGE8!J32=0, \"-\", PAGE8!J32)","v":"-"},{"$f":"IF(PAGE8!K32=0, \"-\", PAGE8!K32)","v":"-"},{"$f":"PAGE8!L32","v":0},{"$f":"PAGE8!M32","v":0},null,{"$f":"PAGE8!N32","v":0}]
[null,null,null,24,{"$f":"PAGE8!D33","v":0},{"$f":"PAGE8!E33","v":0},{"$f":"PAGE8!F33","v":"Pot (cv)"},null,{"$f":"PAGE8!G33","v":"Fases"},{"$f":"PAGE8!H33","v":"Qtd"},{"$f":"PAGE8!I33","v":"Demanda"},{"$f":"IF(PAGE8!J33=0, \"-\", PAGE8!J33)","v":"Fd"},{"$f":"IF(PAGE8!K33=0, \"-\", PAGE8!K33)","v":"-"},{"$f":"PAGE8!L33","v":0},{"$f":"PAGE8!M33","v":0},null,{"$f":"PAGE8!N33","v":0}]
[null,null,null,null,null,null,null,null,"Impressão:",null,null,{"$f":"NOW()","v":"2024-10-04T11:47:26.850"},null,null,null,null,"."]
[null,null,null,null,null,null,null,null,"ART:",null,null,{"$f":"UPPER(PAGE1!G7)","v":""},null,null,null,null,"."]
[null,null,null,"Quadro de Cálculo de Demanda"]

{"sheet":"Planilha1","index":11,"n_rows":12,"n_cols":9,"rows_kept":12,"cut":false,"hidden":true,"merged":[]}
[]
[]
[]
[]
[]
[]
[]
[null,null,null,null,null,null,null,null,"I"]
[]
[null,null,null,null,null,"1F"]
[null,null,null,null,null,null,null,null,"IT"]
[null,null,null,null,null,null,null,null,40]

{"sheet":"PAGE1.1","index":12,"n_rows":38,"n_cols":15,"rows_kept":38,"cut":false,"hidden":false,"merged":[[37,14,37,15],[24,3,24,7],[24,9,24,10],[24,12,24,13],[26,3,26,13],[28,3,28,11],[32,3,32,11],[32,12,32,13],[34,3,34,8],[34,9,34,11],[30,3,30,11],[15,3,15,8],[20,4,20,6],[20,9,20,13],[22,4,22,6],[22,8,22,9],[22,10,22,13],[6,12,6,13],[18,3,18,4],[18,5,18,11],[2,3,2,12],[4,3,4,13],[6,3,6,5],[6,6,6,8],[17,3,17,7],[11,3,11,7],[8,3,8,7],[14,3,14,7],[15,10,15,13],[9,10,9,13],[12,10,12,13],[9,3,9,8],[12,3,12,8]]}
[]
[]
[]
[]
[null,null,null,"1 - Dados da obra"]
[]
[null,null,null,"1.1 - Número da  ART/TRT:",null,null,null,null,null,null,"1.2 - Nº CREA/CFT:"]
[]
[null,null,null,"1.3 - Solicitante:",null,null,null,null,null,null,"1.4 - CPF/CNPJ"]
[]
[]
[null,null,null,"1.5 - E-mail Solicitante:",null,null,null,null,null,null,"1.6 - Telefone Solicitante"]
[]
[]
[null,null,null,"1.7 - E-mail Projetista:",null,null,null,null,null,null,"1.8 - Telefone Projetista:"]
[]
[]
[null,null,null,"1.9 - Endereço da obra (conforme ART):"]
[null,null,null,"Logradouro:",null,null,null,null,null,null,null,null,"Nº"]
[]
[null,null,null,"CEP:",null,null,null,null,"Bairro:"]
[]
[null,null,null,"Cidade:",null,null,null,null,"Comp. / Ref.:"]
[]
[null,null,null,"1.10 - Coordenadas geográficas da Subestação:",null,null,null,null,"Lat:",null,null," Long:"]
[]
[null,null,null,"2 - Referência elétrica"]
[]
[null,null,null,"2.1 - Informe a distância do Ponto de Entrega até o limite da Via pública:",null,null,null,null,null,null,null,null,null,"Metros"]
[]
[null,null,null,"2.2 - Informe a distância do Ponto de Entrega até o poste NEOENERGIA mais próximo:",null,null,null,null,null,null,null,null,null,"Metros"]
[null,null,null,null,null,null,null,null,null,null,null," "]
[null,null,null,"2.3 - Informe o número da plaqueta/barramento do poste NEOENERGIA mais próximo: "]
[]
[null,null,null,"2.4 - Ou, número do medidor de energia mais próximo:"]
[]
[]
[null,null,null,null,null,null,null,null,null,null,null,null,null,null,"Versão 1.3"]

{"sheet":"PAGE2.1","index":13,"n_rows":40,"n_cols":25,"rows_kept":40,"cut":false,"hidden":false,"merged":[[18,12,20,12],[18,13,20,13],[30,12,32,12],[30,13,32,13],[22,12,24,12],[39,13,39,14],[18,3,32,3],[22,8,24,8],[26,8,28,8],[30,8,32,8],[18,5,20,6],[21,5,24,6],[26,5,28,6],[29,5,32,6],[18,8,20,8],[26,12,28,12],[22,13,24,13],[26,13,28,13],[26,9,28,10],[30,11,32,11],[18,11,20,11],[2,3,2,11],[4,3,4,12],[16,5,16,6],[16,8,16,10],[12,3,12,5],[8,3,8,5],[6,3,6,6],[7,3,7,7],[10,6,10,8],[8,8,8,11],[14,3,14,11],[16,12,16,13],[12,7,12,8],[22,11,24,11],[26,11,28,11],[28,7,30,7],[35,3,35,10],[36,3,36,10],[34,3,34,10],[20,7,22,7],[18,9,20,10],[22,9,24,10],[30,9,32,10],[22,4,28,4],[4,19,5,19],[4,20,4,21],[4,22,5,22],[4,23,4,24],[13,3,13,5],[13,7,13,8],[4,17,5,17],[4,18,5,18],[8,13,8,14],[11,6,11,8]]}
[]
[]
[]
[]
[null,null,null,"3 - Dados Técnicos",null,null,null,null,null,null,null,null,null,null,null,null,null,"Potência nominal","Disjuntor (A)","Isolação PVC 70º C (mm²)","Eletroduto diâmetro nominal (mm)",null,"Isolação EPR/XLPE 90º C (mm²)","Eletroduto diâmetro nominal (mm)"]
[null,null,null,null,null,null,null,null,null,null,null,null,null,null,null,null,null,null,null,null,"PVC","AÇO",null,"PVC","AÇO"]
[null,null,null,"3.1 - A Subestação está instalada em via Pública?",null,null,null,null,null,null,null,null,null,null,null,null,null,30,50,"3x16(16)","1.1/4”","1.1/4”","3x10(10)","1.1/4”","1.1/4”"]
[null,null,null,"         Para aprovação é necessário que não esteja em via pública.",null,null,null,null,null,null,null,null,null,null,null,null,null,45,70,"3x25(25)","1.1/4”","1.1/4”","3x16(16)","1.1/4”","1.1/4”"]
[null,null,null,"3.2 - Potência do Transformador (kVA):",null,null,null,null,"*Demanda calculada (kVA):  ",null,null,null,null,"*Deve ser menor ou igual à potência do transformador.",null,null,null,75,125,"3x50(25)","1.1/2”","1.1/2”","3x35(25)","1.1/2”","1.1/2”"]
[null,null,null,null,null,null,null,null,null,null,null,null,null,null,null,null,null,112.5,175,"3x95(50)","2\"","2\"","3x70(35)","2\"","2\""]
[null,null,null,"3.3 - Quanto à modalidade tarifária:",null,null,null,null,null,null,{"$f":"IF(ISBLANK(G11), \"3\",IF(G11=\"Tarifa Horária Azul\", \"1\", IF(G11=\"Tarifa Horária Verde\", \"1\", \"2\")))","v":"3"},null,null,null,null,null,null,150,250,"3x150(70)","2.1/2”","2.1/2”","3x95(50)","2.1/2”","2.1/2”"]
[null,null,null,null,null,null,{"$f":"IF(OR(K11<>\"2\",G9<=112.5),\"\",\"*Clientes com subestação de potência maior que 112,5 kVA não podem optar pela tarifa como grupo B.\")","v":""},null,null,null,null,null,null,null,null,null,null,225,350,"2x[3x95(50)]","2 x 2”","2 x 2”","2x[3x75(35)]","2 x 2”","2 x 2”"]
[null,null,null,"3.4 - Demanda Contratada (kW):",null,null,null,{"$f":"IF(K11<> \"1\",\"\",\"*Demanda Contratada deve ser menor ou igual à potência do Trafo.\")","v":""},null,null,null,null,null,null,null,null,null,300,500,"2x[3x150(70)]","2x2.1/2”","2x2.1/2”","2x[3x95(50)]","2x2.1/2”","2x2.1/2”"]
[null,null,null,"3.4 - Carga Instalada (kW):"]
[null,null,null,"A obra deve seguir os seguintes critérios mínimos para aprovação:"]
[]
[null,null,null,"Disjuntor da Subestação (A)",null,"Condutores do secundário",null,null,"Eletroduto Diâmetro\n Nominal  (mm)",null,null,null,"Poste da Subestação\n(Tipo / Esforço)"]
[]
[null,null,null,{"$f":"IFERROR(INDEX($S$7:$S$13,MATCH($G$9,$R$7:$R$13,0),),\"\")","v":""},null,"Se Isolação PVC 70° C (mm²)",null,null,{"$f":"IFERROR(INDEX($U$7:$U$13,MATCH($G$9,$R$7:$R$13,0),),\"\")","v":""},"PVC",null,null,"Circular",{"$f":"IF(ISBLANK(G9), \"\",IF(AND(G9>0, G9<= 112.5), \"400\", \"600\"))","v":""}]
[]
[null,null,null,null,null,null,null,"OU"]
[null,null,null,null,null,{"$f":"IFERROR(INDEX($T$7:$T$13,MATCH($G$9,$R$7:$R$13,0),),\"\")","v":""}]
[null,null,null,null,"OU",null,null,null,{"$f":"IFERROR(INDEX($V$7:$V$13,MATCH($G$9,$R$7:$R$13,0),),\"\")","v":""},"AÇO",null,null,"Duplo T",{"$f":"IF(ISBLANK(G9), \"\",IF(AND(G9>0, G9<300), \"600\", \"N/A\"))","v":""}]
[]
[]
[]
[null,null,null,null,null,"Se Isolação EPR/XLPE 90° C (mm²)",null,null,{"$f":"IFERROR(INDEX($X$7:$X$13,MATCH($G$9,$R$7:$R$13,0),),\"\")","v":""},"PVC",null,null,"Altura (m)",{"$f":"IF(ISBLANK(G9),\"\",\"11 ou 12\")","v":""}]
[]
[null,null,null,null,null,null,null,"OU"]
[null,null,null,null,null,{"$f":"IFERROR(INDEX($W$7:$W$13,MATCH($G$9,$R$7:$R$13,0),),\"\")","v":""}]
[null,null,null,null,null,null,null,null,{"$f":"IFERROR(INDEX($Y$7:$Y$13,MATCH($G$9,$R$7:$R$13,0),),\"\")","v":""},"AÇO",null,null,"Engast.",{"$f":"IF(ISBLANK(G9), \"\",\"L/10+0,6\")","v":""}]
[]
[]
[]
[null,null,null,"3.5 - Trata-se de Atmosfera Agressiva conforme Item 5.53 da DIS-NOR-012 (REV-04)?"]
[null,null,null,"            Quanto aos Equipamentos: Verificar exigências do Item 7.3.1 da DIS-NOR-012 (REV-04)."]
[null,null,null,"            Quanto aos postes: Verificar exigências do Item 6.3.1 da DIS-NOR-012 (REV-04)."]
[]
[]
[null,null,null,null,null,null,null,null,null,null,null,null,null,"Versão 1.3"]

{"sheet":"PAGE3.1","index":14,"n_rows":51,"n_cols":15,"rows_kept":51,"cut":false,"hidden":false,"merged":[[24,5,24,13],[26,5,26,13],[50,14,50,15],[32,5,34,13],[38,5,39,13],[44,5,44,12],[43,5,43,8],[43,11,43,13],[43,9,43,10],[46,5,48,12],[2,3,2,12],[4,3,4,13],[19,5,20,13],[13,5,13,13],[15,5,15,13],[17,5,17,13],[6,3,6,5],[8,3,8,13],[10,5,10,13]]}
[]
[]
[]
[]
[null,null,null,"4 - Informações da instalação"]
[]
[null,null,null,"4.1 - Caixa de medição"]
[]
[null,null,null,"Obs: Para verificar os todos os tipos de caixas que podem ser usadas neste padrão, consultar a Tabela 14 da DIS-NOR-036 REV 04."]
[]
[null,null,null,null,"4.1.1 -",{"$f":"IF(AND(PAGE2.1!G9>0,PAGE2.1!G9<=45),\"A caixa de medição será conforme Anexo III da norma DIS-ETE-145-REV 01?\",IF(PAGE2.1!G9=75,\"A caixa de medição será conforme Anexo VI da norma DIS-ETE-145 - REV 01?\",IF(PAGE2.1!G9>75,\"A caixa de medição será conforme Anexo VII da norma DIS-ETE-145 - REV 01?\",\"Preencha o item 3.2 - Potência do Transformador\")))","v":"Preencha o item 3.2 - Potência do Transformador"}]
[]
[]
[null,null,null,null,"4.1.2 -","\tA caixa será instalada em mureta, junto ao poste do transformador?"]
[]
[null,null,null,null,"4.1.3 -","A caixa de medição está em local de fácil acesso e boas condições de segurança?"]
[]
[null,null,null,null,"4.1.4 -",{"$f":"IF(AND(PAGE2.1!G9>0,PAGE2.1!G9<=75), \"A altura da parte superior da caixa até o solo será de 1,6m?\", IF(PAGE2.1!G9>75, \"A altura da parte superior da caixa até o solo será de 1,8m?\",  \"Preencha o item 3.2 - Potência do Transformador\"))","v":"Preencha o item 3.2 - Potência do Transformador"}]
[]
[null,null,null,null,"4.1.5 -","Será instalado eletroduto com diâmetro de 20 mm para permitir a leitura remota, respeitando o item 7.9.1.16 do normativo DIS-NOR-036?"]
[]
[]
[null,null,null,"4.2 - Eletroduto da Subestação Aérea"]
[]
[null,null,null,null,"4.2.1 -","O eletroduto está totalmente aparente? "]
[]
[null,null,null,null,"4.2.2 -",{"$f":"IF(PAGE2.1!L35=\"NÃO\",\"O eletroduto é de ferro galvanizado parede dupla e está aterrado?\",IF(PAGE2.1!L35=\"SIM\",\"Trata-se de Atmosfera Agressiva e portanto está sendo instalado o eletroduto de PVC?\",\"Preencher Item 3.5 sobre qual tipo de ambiente.\"))","v":"Preencher Item 3.5 sobre qual tipo de ambiente."}]
[]
[]
[]
[null,null,null,"4.3 - Aterramento"]
[]
[null,null,null,null,"4.3.1 -","O aterramento da subestação aérea será feito por no mínimo 4 hastes interligadas por meio cabo de cobre nu de seção mínima de 50 mm² ou aço cobreado 2 AWG, conforme NBR 15751 e conforme item 7.25.10.7 da norma DIS-NOR-036?"]
[]
[]
[]
[null,null,null,"4.4 - Distância de segurança"]
[]
[null,null,null,null,"4.4.1 -","A subestação será montada de forma que atenda à distâncias de segurança do Anexo VIII da norma DIS-NOR-012?"]
[]
[]
[null,null,null,"4.5 - Entrada de Energia"]
[]
[null,null,null,null,"4.5.1 -","Existe alguma medição ativa no local?",null,null,null,"Conta Contrato:",null,null,null,null,"*"]
[null,null,null,null,null,"Obs.: A ligação da Subestação está condicionada à desativação da medição existente."]
[]
[null,null,null,null,"4.5.2 -",{"$f":"IF(PAGE2.1!L35=\"SIM\",\"As estruturas do poste do cliente são de ancoragem e estão no padrão para ser conectado o cabo de cobre nú?\",IF(PAGE2.1!L35=\"NÃO\",\"As estruturas do poste do cliente são de ancoragem e estão no padrão de rede compacta?\",\"Preencher Item 3.5 sobre qual tipo de ambiente.\"))","v":"Preencher Item 3.5 sobre qual tipo de ambiente."}]
[]
[]
[]
[null,null,null,null,null,null,null,null,null,null,null,null,null,null,"Versão 1.3"]

{"sheet":"PAGE 4.2","index":15,"n_rows":79,"n_cols":83,"rows_kept":79,"cut":false,"hidden":false,"merged":[[78,23,81,72],[95,62,97,62],[49,38,54,44],[49,50,54,56],[59,38,61,46],[59,48,61,56],[66,47,68,47],[72,41,75,53],[13,7,16,88],[18,12,61,13],[18,82,61,83],[21,19,26,40],[22,44,24,50],[26,44,36,50],[40,48,45,54],[46,31,61,35],[46,59,61,64]]}
[]
[]
[]
[]
[]
[]
[]
[]
[]
[]
[]
[]
[]
[null,null,null,null,null,null,null,"PLANTA SITUAÇÃO/LOCALIZAÇÃO"]
[]
[]
[]
[]
[null,null,null,null,null,null,null,null,null,null,null,null,"Anotar Nome da Rua",null,null,null,null,null,null,null,null,null,null,null,null,null,null,null,null,null,null,null,null,null,null,null,null,null,null,null,null,null,null,null,null,null,null,null,null,null,null,null,null,null,null,null,null,null,null,null,null,null,null,null,null,null,null,null,null,null,null,null,null,null,null,null,null,null,null,null,null,null,"Anotar Nome da Rua"]
[]
[]
[null,null,null,null,null,null,null,null,null,null,null,null,null,null,null,null,null,null,null,"Nota: Todos os afastamentos indicados em relação ao poste devem ser indicados em metros."]
[null,null,null,null,null,null,null,null,null,null,null,null,null,null,null,null,null,null,null,null,null,null,null,null,null,null,null,null,null,null,null,null,null,null,null,null,null,null,null,null,null,null,null,null,"Edificação"]
[]
[]
[]
[null,null,null,null,null,null,null,null,null,null,null,null,null,null,null,null,null,null,null,null,null,null,null,null,null,null,null,null,null,null,null,null,null,null,null,null,null,null,null,null,null,null,null,null,"Anotar Finalidade da Empresa"]
[]
[]
[]
[]
[]
[]
[]
[]
[]
[]
[]
[]
[]
[null,null,null,null,null,null,null,null,null,null,null,null,null,null,null,null,null,null,null,null,null,null,null,null,null,null,null,null,null,null,null,null,null,null,null,null,null,null,null,null,null,null,null,null,null,null,null,null,"Anotar distância (M)"]
[]
[]
[]
[]
[]
[null,null,null,null,null,null,null,null,null,null,null,null,null,null,null,null,null,null,null,null,null,null,null,null,null,null,null,null,null,null,null,"Anotar UC ou Medidor do Vizinho",null,null,null,null,null,null,null,null,null,null,null,null,null,null,null,null,null,null,null,null,null,null,null,null,null,null,null,"Anotar UC ou Medidor do Vizinho"]
[]
[]
[null,null,null,null,null,null,null,null,null,null,null,null,null,null,null,null,null,null,null,null,null,null,null,null,null,null,null,null,null,null,null,null,null,null,null,null,null,null,"Anotar distância (M)",null,null,null,null,null,null,null,null,null,null,null,"Anotar distância (M)"]
[]
[]
[]
[]
[]
[]
[]
[]
[]
[null,null,null,null,null,null,null,null,null,null,null,null,null,null,null,null,null,null,null,null,null,null,null,null,null,null,null,null,null,null,null,null,null,null,null,null,null,null,{"$f":"CONCATENATE(PAGE1.1!M29,\" m\",)","v":" m"},null,null,null,null,null,null,null,null,null,{"$f":"CONCATENATE(PAGE1.1!J25,\" ; \",PAGE1.1!M25)","v":" ; "}]
[]
[]
[]
[]
[]
[]
[]
[]
[]
[]
[]
[]
[null,null,null,null,null,null,null,null,null,null,null,null,null,null,null,null,null,null,null,null,null,null,null,null,null,null,null,null,null,null,null,null,null,null,null,null,null,null,null,null,null,"INTERLIGAÇÃO DISTRIBUIDORA"]
[]
[]
[]
[]
[]
[null,null,null,null,null,null,null,null,null,null,null,null,null,null,null,null,null,null,null,null,null,null,null,{"$f":"CONCATENATE(PAGE1.1!F19,\", \",PAGE1.1!N19,\", \",PAGE1.1!J21,\" - \",PAGE1.1!E23)","v":", ,  - "}]

{"sheet":"PAGE4.1","index":16,"n_rows":22,"n_cols":15,"rows_kept":22,"cut":false,"hidden":false,"merged":[[2,3,2,12],[5,10,5,12],[6,10,6,12],[21,14,21,15],[6,3,6,7],[7,3,17,7],[18,3,18,7]]}
[]
[null,null,{"$f":"IF(PAGE9.1!F7 = 37, \"1\", \"0\")","v":"0"}]
[]
[]
[]
[]
[null,null,null,"Anotações / Informações adicionais."]
[]
[]
[]
[]
[]
[]
[]
[]
[]
[]
[]
[null,null,null,"Limite de 1500 caracteres."]
[]
[]
[null,null,null,null,null,null,null,null,null,null,null,null,null,null,"Versão 1.3"]

{"sheet":"PAGE9.1","index":17,"n_rows":47,"n_cols":9,"rows_kept":47,"cut":false,"hidden":false,"merged":[[9,6,9,7]]}
[]
[]
[]
[]
[]
[null,null,null,null,"Total de itens:",37]
[null,null,null,null,"Conforme",{"$f":"COUNTIF(H11:H47,3)","v":1}]
[null,null,null,null,"Inconforme",{"$f":"COUNTIF(H11:H47, 2)","v":36}]
[]
[null,null,"Item","Campo","Local","Situação","Status"]
[null,null,1,"ART_REGISTRO","PAG_DADOS_OBRA",{"$f":"IF(OR(ISBLANK(PAGE1.1!G7),ISBLANK(PAGE1.1!M7)), \"VAZIO\", \"PREENCHIDO\")","v":"VAZIO"},"Ver",{"$f":"I11+1","v":2},{"$f":"IF(F11=\"VAZIO\", \"1\", \"2\")","v":"1"}]
[null,null,2,"SOLICITANTE","PAG_DADOS_OBRA",{"$f":"IF(ISBLANK(PAGE1.1!D10), \"VAZIO\", \"PREENCHIDO\")","v":"VAZIO"},"Ver",{"$f":"I12+1","v":2},{"$f":"IF(F12=\"VAZIO\", \"1\", \"2\")","v":"1"}]
[null,null,3,"CPF_CNPJ","PAG_DADOS_OBRA",{"$f":"IF(ISBLANK(PAGE1.1!K10), \"VAZIO\", \"PREENCHIDO\")","v":"VAZIO"},"Ver",2,"1"]
[null,null,4,"EMAIL_SOLICITANTE","PAG_DADOS_OBRA",{"$f":"IF(ISBLANK(PAGE1.1!D13), \"VAZIO\", \"PREENCHIDO\")","v":"VAZIO"},"Ver",2,"1"]
[null,null,5,"EMAIL_PROJETISTA","PAG_DADOS_OBRA",{"$f":"IF(ISBLANK(PAGE1.1!D16), \"VAZIO\", \"PREENCHIDO\")","v":"VAZIO"},"Ver",2,"1"]
[null,null,6,"TELEFONE_SOLICITANTE","PAG_DADOS_OBRA",{"$f":"IF(ISBLANK(PAGE1.1!K13), \"VAZIO\", \"PREENCHIDO\")","v":"VAZIO"},"Ver",2,"1"]
[null,null,7,"TELEFONE_PROJETISTA","PAG_DADOS_OBRA",{"$f":"IF(ISBLANK(PAGE1.1!K16), \"VAZIO\", \"PREENCHIDO\")","v":"VAZIO"},"Ver",2,"1"]
[null,null,8,"END_LOGRADOURO","PAG_DADOS_OBRA",{"$f":"IF(ISBLANK(PAGE1.1!F19), \"VAZIO\", \"PREENCHIDO\")","v":"VAZIO"},"Ver",{"$f":"I18+1","v":2},"1"]
[null,null,9,"END_N_CASA","PAG_DADOS_OBRA",{"$f":"IF(ISBLANK(PAGE1.1!N19), \"VAZIO\", \"PREENCHIDO\")","v":"VAZIO"},"Ver",2,"1"]
[null,null,10,"END_CEP","PAG_DADOS_OBRA",{"$f":"IF(ISBLANK(PAGE1.1!E21), \"VAZIO\", \"PREENCHIDO\")","v":"VAZIO"},"Ver",2,{"$f":"IF(F20=\"VAZIO\", \"1\", \"2\")","v":"1"}]
[null,null,11,"END_BAIRRO","PAG_DADOS_OBRA",{"$f":"IF(ISBLANK(PAGE1.1!J21), \"VAZIO\", \"PREENCHIDO\")","v":"VAZIO"},"Ver",2,"1"]
[null,null,12,"END_CIDADE","PAG_DADOS_OBRA",{"$f":"IF(ISBLANK(PAGE1.1!E23), \"VAZIO\", \"PREENCHIDO\")","v":"VAZIO"},"Ver",2,"1"]
[null,null,13,"END_COMPLEMENTO","PAG_DADOS_OBRA",{"$f":"IF(ISBLANK(PAGE1.1!K23), \"VAZIO\", \"PREENCHIDO\")","v":"VAZIO"},"Ver",{"$f":"I23+1","v":2},{"$f":"IF(F23=\"VAZIO\", \"1\", \"2\")","v":"1"}]
[null,null,14,"LATITUDE","PAG_DADOS_OBRA",{"$f":"IF(ISBLANK(PAGE1.1!J25), \"VAZIO\", \"PREENCHIDO\")","v":"VAZIO"},"Ver",2,{"$f":"IF(F24=\"VAZIO\", \"1\", \"2\")","v":"1"}]
[null,null,15,"LONGITUDE","PAG_DADOS_OBRA",{"$f":"IF(ISBLANK(PAGE1.1!M25), \"VAZIO\", \"PREENCHIDO\")","v":"VAZIO"},"Ver",2,"1"]
[null,null,16,"LIMITE_POSTE","PAG_DADOS_OBRA",{"$f":"IF(ISBLANK(PAGE1.1!M29), \"VAZIO\", \"PREENCHIDO\")","v":"VAZIO"},"Ver",2,"1"]
[null,null,17,"DISTANCIA_POSTE_NEOPE","PAG_DADOS_OBRA",{"$f":"IF(ISBLANK(PAGE1.1!M31), \"VAZIO\", \"PREENCHIDO\")","v":"VAZIO"},"Ver",2,{"$f":"IF(F27=\"VAZIO\", \"1\", \"2\")","v":"1"}]
[null,null,18,"BARRAMENTO_NEOPE","PAG_DADOS_OBRA",{"$f":"IF(ISBLANK(PAGE1.1!M33), \"VAZIO\", \"PREENCHIDO\")","v":"VAZIO"},"Ver",2,{"$f":"IF(AND(F28=\"VAZIO\",F29=\"VAZIO\"), \"1\", \"2\")","v":"1"}]
[null,null,19,"MEDIDOR_VIZINHO","PAG_DADOS_OBRA",{"$f":"IF(ISBLANK(PAGE1.1!J35), \"VAZIO\", \"PREENCHIDO\")","v":"VAZIO"},"Ver",2,{"$f":"IF(AND(F28=\"VAZIO\",F29=\"VAZIO\"), \"1\", \"2\")","v":"1"}]
[null,null,20,"POSIÇÃO_SUBESTAÇÃO","PAG_DADOS_TECNICOS",{"$f":"IF(PAGE2.1!H7= \"SIM\", \"PREENCHIDO COM SIM\",  IF(PAGE2.1!H7= \"NÃO\",\"PREENCHIDO COM NÃO\", \"VAZIO\"))","v":"VAZIO"},"Ver",{"$f":"I30+1","v":2},{"$f":"IF(F30=\"PREENCHIDO COM NÃO\", \"2\", \"1\")","v":"1"}]
[null,null,21,"TRANSFORMADOR","PAG_DADOS_TECNICOS",{"$f":"IF(ISBLANK(PAGE2.1!G9), \"VAZIO\", \"PREENCHIDO\")","v":"VAZIO"},"Ver",2,{"$f":"IF(F31=\"VAZIO\", \"1\", \"2\")","v":"1"}]
[null,null,22,"DEMANDA_CALCULADA","PAG_DADOS_TECNICOS",{"$f":"IF(ISBLANK(PAGE2.1!M9),\"VAZIO\",IF(PAGE2.1!M9<=PAGE2.1!G9,\"PREENCHIDO\",\"PREENCHIDO INCORRETO\"))","v":"VAZIO"},"Ver",2,{"$f":"IF(F32=\"VAZIO\",\"1\",IF(F32=\"PREENCHIDO\",\"2\",\"1\"))","v":"1"}]
[null,null,23,"TIPO_TARIFA","PAG_DADOS_TECNICOS",{"$f":"IF(ISBLANK(PAGE2.1!G11), \"VAZIO\", IF(PAGE2.1!G11= \"Tarifa Horária Azul\",  \"PREENCHIDO COM TARIFA HORÁRIA AZUL\", IF(PAGE2.1!G11= \"Tarifa Horária Verde\",  \"PREENCHIDO COM TARIFA HORÁRIA VERDE\", \"PREENCHIDO COM OPTANTE GRUPO B\")))","v":"VAZIO"},"Ver",{"$f":"I33+1","v":2},{"$f":"IF(ISBLANK(PAGE2.1!G11), \"1\", IF(AND(PAGE2.1!G11= \"Tarifa Horária Azul\", F34= \"PREENCHIDO\"), \"2\", IF(AND(PAGE2.1!G11= \"Tarifa Horária Verde\",F34=\"PREENCHIDO\"),  \"2\", IF(AND(F33 = \"PREENCHIDO COM OPTANTE GRUPO B\",PAGE2.1!G12=\"\"), \"2\",\"1\"))))","v":"1"}]
[null,null,24,{"$f":"IF(PAGE2.1!K11<>\"2\",\"DEMANDA_CONTRATADA\",\"CARGA_INSTALADA\")","v":"DEMANDA_CONTRATADA"},"PAG_DADOS_TECNICOS",{"$f":"IF(F33 = \"PREENCHIDO COM OPTANTE GRUPO B\", IF(ISBLANK(PAGE2.1!G14), \"VAZIO\",\"PREENCHIDO\"),IF(ISBLANK(PAGE2.1!G13), \"VAZIO\", IF(PAGE2.1!G13<=PAGE2.1!G9,\"PREENCHIDO\",\"PREENCHIDO INCORRETO\")))","v":"VAZIO"},"Ver",{"$f":"I34+1","v":2},{"$f":"IF(ISBLANK(PAGE2.1!G11), \"1\", IF(AND(PAGE2.1!G11= \"Tarifa Horária Azul\", F34= \"PREENCHIDO\"), \"2\", IF(AND(PAGE2.1!G11= \"Tarifa Horária Verde\",F34=\"PREENCHIDO\"),  \"2\", IF(AND(F33 = \"PREENCHIDO COM OPTANTE GRUPO B\",PAGE2.1!G14<>0), \"2\",\"1\"))))","v":"1"}]
[null,null,25,"TIPO_ATMOSFERA","PAG_DADOS_TECNICOS",{"$f":"IF(ISBLANK(PAGE2.1!L35), \"VAZIO\", \"PREENCHIDO\")","v":"VAZIO"},"Ver",{"$f":"I35+1","v":2},{"$f":"IF(F35=\"VAZIO\",\"1\",\"2\")","v":"1"}]
[null,null,26,"CAIXA_MEDIÇÃO_PADRAO","PAG_INSTALACAO",{"$f":"IF(PAGE3.1!D11= \"SIM\", \"PREENCHIDO COM SIM\",  IF(PAGE3.1!D11= \"NÃO\",\"PREENCHIDO COM NÃO\", \"VAZIO\"))","v":"VAZIO"},"Ver",2,{"$f":"IF(F36=\"PREENCHIDO COM SIM\", \"2\", \"1\")","v":"1"}]
[null,null,27,"CAIXA_MEDIÇÃO_MURETA","PAG_INSTALACAO",{"$f":"IF(PAGE3.1!D14= \"SIM\", \"PREENCHIDO COM SIM\",  IF(PAGE3.1!D14= \"NÃO\",\"PREENCHIDO COM NÃO\", \"VAZIO\"))","v":"VAZIO"},"Ver",2,"1"]
[null,null,28,"CAIXA_MEDIÇÃO_SEGURANÇA","PAG_INSTALACAO",{"$f":"IF(PAGE3.1!D16= \"SIM\", \"PREENCHIDO COM SIM\",  IF(PAGE3.1!D16= \"NÃO\",\"PREENCHIDO COM NÃO\", \"VAZIO\"))","v":"VAZIO"},"Ver",2,"1"]
[null,null,29,"CAIXA_MEDIÇÃO_ALTURA","PAG_INSTALACAO",{"$f":"IF(PAGE3.1!D18= \"SIM\", \"PREENCHIDO COM SIM\",  IF(PAGE3.1!D18= \"NÃO\",\"PREENCHIDO COM NÃO\", \"VAZIO\"))","v":"VAZIO"},"Ver",2,"1"]
[null,null,30,"CAIXA_MEDIÇÃO_REMOTA","PAG_INSTALACAO",{"$f":"IF(PAGE3.1!D20= \"SIM\", \"PREENCHIDO COM SIM\",  IF(PAGE3.1!D20= \"NÃO\",\"PREENCHIDO COM NÃO\", \"VAZIO\"))","v":"VAZIO"},"Ver",2,"1"]
[null,null,31,"ELETRODUTO","PAG_INSTALACAO",{"$f":"IF(PAGE3.1!D25= \"SIM\", \"PREENCHIDO COM SIM\",  IF(PAGE3.1!D25= \"NÃO\",\"PREENCHIDO COM NÃO\", \"VAZIO\"))","v":"VAZIO"},"Ver",2,"1"]
[null,null,32,"ELETRODUTO_MATERIAL","PAG_INSTALACAO",{"$f":"IF(PAGE3.1!D27= \"SIM\", \"PREENCHIDO COM SIM\",  IF(PAGE3.1!D27= \"NÃO\",\"PREENCHIDO COM NÃO\", \"VAZIO\"))","v":"VAZIO"},"Ver",2,{"$f":"IF(F42=\"PREENCHIDO COM SIM\", \"2\", \"1\")","v":"1"}]
[null,null,33,"ATERRAMENTO","PAG_INSTALACAO",{"$f":"IF(PAGE3.1!D33= \"SIM\", \"PREENCHIDO COM SIM\",  IF(PAGE3.1!D33= \"NÃO\",\"PREENCHIDO COM NÃO\", \"VAZIO\"))","v":"VAZIO"},"Ver",2,"1"]
[null,null,34,"DISTANCIA_SEGURANÇA","PAG_INSTALACAO",{"$f":"IF(PAGE3.1!D39= \"SIM\", \"PREENCHIDO COM SIM\",  IF(PAGE3.1!D39= \"NÃO\",\"PREENCHIDO COM NÃO\", \"VAZIO\"))","v":"VAZIO"},"Ver",2,"1"]
[null,null,35,"ENTRADA_ENERGIA","PAG_INSTALACAO",{"$f":"IF(PAGE3.1!D44= \"SIM\", \"PREENCHIDO COM SIM\",  IF(PAGE3.1!D44= \"NÃO\",\"PREENCHIDO COM NÃO\", \"VAZIO\"))","v":"VAZIO"},"Ver",{"$f":"I45+1","v":2},{"$f":"IF(F45=\"VAZIO\", \"1\", \"2\")","v":"1"}]
[null,null,36,"CONTA_CONTRATO","PAG_INSTALACAO",{"$f":"IF(ISBLANK(PAGE3.1!L44), \"VAZIO\", \"PREENCHIDO\")","v":"VAZIO"},"Ver",3,{"$f":"IF(AND(F45= \"PREENCHIDO COM SIM\", F46=\"VAZIO\"), \"1\", \"2\")","v":"2"}]
[null,null,37,"ESTRUTURA_PADRAO","PAG_INSTALACAO",{"$f":"IF(PAGE3.1!D47= \"SIM\", \"PREENCHIDO COM SIM\",  IF(PAGE3.1!D47= \"NÃO\",\"PREENCHIDO COM NÃO\", \"VAZIO\"))","v":"VAZIO"},"Ver",2,{"$f":"IF(F47=\"PREENCHIDO COM SIM\", \"2\", \"1\")","v":"1"}]

{"sheet":"PAGE10.1","index":18,"n_rows":227,"n_cols":14,"rows_kept":227,"cut":false,"hidden":false,"merged":[[172,5,172,9],[172,10,172,13],[179,5,179,9],[179,10,179,13],[180,5,180,9],[180,10,180,13],[181,5,181,9],[181,10,181,13],[182,5,182,9],[182,10,182,13],[160,5,160,9],[160,10,160,13],[161,5,161,9],[161,10,161,13],[162,5,162,9],[162,10,162,13],[163,5,163,9],[163,10,163,13],[171,5,171,9],[171,10,171,13],[155,5,155,9],[155,10,155,13],[156,5,156,9],[156,10,156,13],[157,5,157,9],[157,10,157,13],[158,5,158,9],[158,10,158,13],[159,5,159,9],[159,10,159,13],[150,5,150,9],[150,10,150,13],[151,5,151,9],[151,10,151,13],[152,5,152,9],[152,10,152,13],[153,5,153,9],[153,10,153,13],[154,5,154,9],[154,10,154,13],[199,3,202,3],[203,3,204,3],[119,3,119,13],[161,3,189,3],[190,3,192,3],[193,3,195,3],[196,3,198,3],[204,5,204,13],[189,5,191,13],[195,5,196,13],[200,5,200,8],[200,9,200,10],[200,11,200,13],[184,6,184,10],[145,5,145,9],[145,10,145,13],[146,5,146,9],[146,10,146,13],[147,5,147,9],[147,10,147,13],[148,5,148,9],[148,10,148,13],[149,5,149,9],[149,10,149,13],[116,5,116,13],[120,5,120,13],[122,5,123,13],[59,10,61,10],[61,8,63,8],[62,6,65,7],[63,9,65,9],[51,10,53,10],[53,8,55,8],[55,13,57,13],[67,3,67,10],[68,3,68,10],[96,5,98,13],[102,5,103,13],[81,5,81,13],[83,5,83,13],[85,5,86,13],[90,5,90,13],[92,5,92,13],[69,3,69,10],[51,6,53,7],[54,6,57,7],[31,3,31,11],[37,3,37,13],[39,3,39,7],[41,3,41,7],[47,3,47,13],[1,2,1,3],[110,5,110,13],[41,10,41,12],[107,5,107,8],[107,9,107,10],[107,11,107,13],[71,3,71,13],[73,3,73,5],[75,3,75,13],[79,5,79,13],[77,5,77,13],[51,3,65,4],[49,3,49,4],[59,6,61,7],[59,9,61,9],[63,10,65,10],[63,12,65,12],[63,13,65,13],[55,12,57,12],[4,3,4,13],[6,3,6,5],[6,6,6,8],[9,10,9,13],[9,3,9,8],[7,3,7,5],[7,6,7,8],[27,3,27,13],[29,3,29,11],[25,9,25,10],[25,12,25,13],[23,4,23,6],[23,8,23,9],[23,10,23,13],[25,3,25,7],[49,6,49,7],[51,9,53,9],[33,12,33,13],[55,5,61,5],[55,9,57,9],[55,10,57,10],[45,3,45,7],[43,3,43,7],[49,12,49,13],[35,3,35,8],[35,9,35,11],[51,12,54,12],[51,13,54,13],[59,12,62,12],[59,13,62,13],[49,9,49,10],[226,3,228,13],[223,7,223,8],[223,9,223,10],[224,3,224,13],[222,2,222,3],[222,7,222,8],[222,9,222,10],[1,7,1,8],[1,9,1,10],[33,3,33,11],[19,5,19,11],[19,3,19,4],[2,3,2,12],[8,3,8,7],[11,3,11,7],[12,3,12,8],[12,10,12,13],[14,3,14,7],[15,3,15,8],[15,10,15,13],[17,3,17,7],[21,4,21,6],[21,9,21,13],[43,8,43,10]]}
[]
[null,null,"Versão 1.3",null,null,null,null,"Data de Impressão:",null,{"$f":"NOW()","v":"2024-10-04T11:47:26.860"}]
[]
[]
[null,null,null,"1 - Dados da obra"]
[]
[null,null,null,{"$f":"PAGE1.1!D7","v":"1.1 - Número da  ART/TRT:"},null,null,{"$f":"UPPER(PAGE1.1!G7)","v":""}]
[null,null,null,{"$f":"PAGE1.1!K7","v":"1.2 - Nº CREA/CFT:"},null,null,{"$f":"UPPER(PAGE1.1!M7)","v":""}]
[null,null,null,{"$f":"PAGE1.1!D9","v":"1.3 - Solicitante:"},null,null,null,null,null,null,{"$f":"PAGE1.1!K9","v":"1.4 - CPF/CNPJ"}]
[null,null,null,{"$f":"UPPER(PAGE1.1!D10)","v":""},null,null,null,null,null,null,{"$f":"PAGE1.1!K10","v":0}]
[]
[null,null,null,{"$f":"PAGE1.1!D12","v":"1.5 - E-mail Solicitante:"},null,null,null,null,null,null,{"$f":"PAGE1.1!K12","v":"1.6 - Telefone Solicitante"}]
[null,null,null,{"$f":"UPPER(PAGE1.1!D13)","v":""},null,null,null,null,null,null,{"$f":"PAGE1.1!K13","v":0}]
[]
[null,null,null,{"$f":"PAGE1.1!D15","v":"1.7 - E-mail Projetista:"},null,null,null,null,null,null,{"$f":"PAGE1.1!K15","v":"1.8 - Telefone Projetista:"}]
[null,null,null,{"$f":"UPPER(PAGE1.1!D16)","v":""},null,null,null,null,null,null,{"$f":"PAGE1.1!K16","v":0}]
[]
[null,null,null,{"$f":"PAGE1.1!D18","v":"1.9 - Endereço da obra (conforme ART):"}]
[]
[null,null,null,"Logradouro:",null,{"$f":"UPPER(PAGE1.1!F19)","v":""},null,null,null,null,null,null,"Nº",{"$f":"UPPER(PAGE1.1!N19)","v":""}]
[]
[null,null,null,"CEP:",{"$f":"PAGE1.1!E21","v":0},null,null,null,"Bairro:",{"$f":"UPPER(PAGE1.1!J21)","v":""}]
[]
[null,null,null,"Cidade:",{"$f":"UPPER(PAGE1.1!E23)","v":""},null,null,null,"Comp. / Ref.:      ",null,{"$f":"UPPER(PAGE1.1!K23)","v":""}]
[]
[null,null,null,{"$f":"PAGE1.1!D25","v":"1.10 - Coordenadas geográficas da Subestação:"},null,null,null,null,"Lat:",{"$f":"UPPER(PAGE1.1!J25)","v":""},null," Long:",{"$f":"UPPER(PAGE1.1!M25)","v":""}]
[]
[null,null,null,"2 - Referência elétrica"]
[]
[null,null,null,"2.1 - Informe a distância do Ponto de Entrega até o limite da Via pública:",null,null,null,null,null,null,null,null,{"$f":"PAGE1.1!M29","v":0},"Metros"]
[]
[null,null,null,"2.2 - Informe a distância do Ponto de Entrega até o poste NEOPE mais próximo:",null,null,null,null,null,null,null,null,{"$f":"PAGE1.1!M31","v":0},"Metros"]
[]
[null,null,null,"2.3 - Informe o número da plaqueta/barramento que existe no poste da NEOPE mais próximo: ",null,null,null,null,null,null,null,null,{"$f":"UPPER(PAGE1.1!M33)","v":""}]
[]
[null,null,null,"2.4 - Ou, número do medidor de energia mais próximo:",null,null,null,null,null,{"$f":"UPPER(PAGE1.1!J35)","v":""}]
[]
[null,null,null,"3 - Dados Técnicos"]
[]
[null,null,null,"3.1 - A Substação está instalada em via Pública?",null,null,null,null,{"$f":"PAGE2.1!H7","v":0}]
[]
[null,null,null,"3.2 - Potência do Transformador (kVA):",null,null,null,null,{"$f":"PAGE2.1!G9","v":0},null,"Demanda calculada (kVA):  ",null,null,{"$f":"IF(ISBLANK(PAGE2.1!M9),\"VAZIO\", PAGE2.1!M9)","v":"VAZIO"}]
[]
[null,null,null,"3.3 - Quanto à modalidade tarifária:",null,null,null,null,{"$f":"PAGE2.1!G11","v":0},null,null,{"$f":"PAGE2.1!K11","v":"3"}]
[]
[null,null,null,{"$f":"IF(L44=\"1\",PAGE2.1!D$13,PAGE2.1!D$14)","v":"3.4 - Carga Instalada (kW):"},null,null,null,null,{"$f":"IF(L44=\"1\",PAGE2.1!G$13,PAGE2.1!G$14)","v":0}]
[]
[null,null,null,"A obra deve seguir os seguintes critérios mínimos para aprovação:"]
[]
[null,null,null,"Disjuntor da Substação (A)",null,null,"Condutores do secundário",null,null,"Eletroduto Diâmetro \nNominal  (mm)",null,null,"Poste da Subestação\n(Tipo / Esforço)"]
[]
[null,null,null,{"$f":"PAGE2.1!D19","v":""},null,null,"Se Isolação PVC 70° C (mm²)",null,null,{"$f":"PAGE2.1!I19","v":""},"PVC",null,"Circular",{"$f":"PAGE2.1!N19","v":""}]
[]
[null,null,null,null,null,null,null,null,"OU"]
[null,null,null,null,null,null,{"$f":"PAGE2.1!F22","v":""}]
[null,null,null,null,null,"OU",null,null,null,{"$f":"PAGE2.1!I23","v":""},"AÇO",null,"Duplo T",{"$f":"PAGE2.1!N23","v":""}]
[]
[]
[]
[null,null,null,null,null,null,"Se Isolação EPR/XLPE 90° C (mm²)",null,null,{"$f":"PAGE2.1!I27","v":""},"PVC",null,"Altura (m)",{"$f":"PAGE2.1!N27","v":""}]
[]
[null,null,null,null,null,null,null,null,"OU"]
[null,null,null,null,null,null,{"$f":"PAGE2.1!F30","v":""}]
[null,null,null,null,null,null,null,null,null,{"$f":"PAGE2.1!I31","v":""},"AÇO",null,"Engast.",{"$f":"PAGE2.1!N31","v":""}]
[]
[]
[]
[null,null,null,"3.5 - Trata-se de Atemosfera Agressiva conforme Item 5.53 da DIS-NOR-012 (REV-04)?",null,null,null,null,null,null,null,{"$f":"PAGE2.1!L35","v":0}]
[null,null,null,"            Quanto aos Equipamentos: Verificar exigências do Item 7.3.1 da DIS-NOR-012 (REV-04)."]
[null,null,null,"            Quanto aos postes: Verificar exigências do Item 6.3.1 da DIS-NOR-012 (REV-04)."]
[]
[null,null,null,"4 - Informações da instalação"]
[]
[null,null,null,"4.1 - Caixa de medição"]
[]
[null,null,null,"Para verificar todos os tipos de caixas que podem ser usadas neste padrão, consultar a Tabela 14 da DIS-NOR-036 REV 04."]
[]
[null,null,null,{"$f":"PAGE3.1!D11","v":0},"4.1.1 -",{"$f":"PAGE3.1!F11","v":"Preencha o item 3.2 - Potência do Transformador"}]
[]
[null,null,null,{"$f":"PAGE3.1!D14","v":0},"4.1.2 -","\tA caixa será instalada em mureta, junto ao poste do transformador?"]
[]
[null,null,null,{"$f":"PAGE3.1!D16","v":0},"4.1.3 -","A caixa de medição está em local de fácil acesso e boas condições de segurança?"]
[]
[null,null,null,{"$f":"PAGE3.1!D18","v":0},"4.1.4 -",{"$f":"PAGE3.1!F18","v":"Preencha o item 3.2 - Potência do Transformador"}]
[]
[null,null,null,{"$f":"PAGE3.1!D20","v":0},"4.1.5 -",{"$f":"PAGE3.1!F20","v":"Será instalado eletroduto com diâmetro de 20 mm para permitir a leitura remota, respeitando o item 7.9.1.16 do normativo DIS-NOR-036?"}]
[]
[]
[null,null,null,"4.2 - Eletroduto da Subestação Aérea"]
[]
[null,null,null,{"$f":"PAGE3.1!D25","v":0},"4.2.1 -","O eletroduto está totalmente aparente? "]
[]
[null,null,null,{"$f":"PAGE3.1!D27","v":0},"4.2.2 -",{"$f":"PAGE3.1!F27","v":"Preencher Item 3.5 sobre qual tipo de ambiente."}]
[]
[null,null,null,"4.3 - Aterramento"]
[]
[null,null,null,{"$f":"PAGE3.1!D33","v":0},"4.3.1 -","O aterramento da subestação aérea será feito por no mínimo 4 hastes interligadas por meio cabo de cobre nu de seção mínima de 50 mm² ou aço cobreado 2 AWG, comforme NBR 15751 e conforme item 7.33.10.7 da norma DIS-NOR-036?"]
[]
[]
[]
[null,null,null,"4.4 - Distância de segurança"]
[]
[null,null,null,{"$f":"PAGE3.1!D39","v":0},"4.4.1 -","A subestação será montada de forma que atenda à distâncias de segurança do Ane-xo VIII da norma DIS-NOR-012?"]
[]
[]
[null,null,null,"4.5 - Entrada de Energia"]
[]
[null,null,null,{"$f":"PAGE3.1!D44","v":0},"4.5.1 -","Existe alguma medição ativa no local?",null,null,null,"Conta Contrato:  ",null,{"$f":"IF(ISBLANK(PAGE3.1!L44), \"VAZIO\", PAGE3.1!L44)","v":"VAZIO"}]
[null,null,null,null,null,{"$f":"PAGE3.1!F45","v":"Obs.: A ligação da Subestação está condicionada à desativação da medição existente."}]
[]
[null,null,null,{"$f":"PAGE3.1!D47","v":0},"4.5.2 -",{"$f":"PAGE3.1!F47","v":"Preencher Item 3.5 sobre qual tipo de ambiente."}]
[]
[]
[]
[]
[]
[]
[null,null,null,"Versão 1.3",null,null,null,null,"Data da Impressão:",{"$f":"NOW()","v":"2024-10-04T11:47:26.850"}]
[]
[null,null,null,"DIAGRAMA UNIFILAR - LOCAÇÃO - DETALHES:"]
[]
[]
[]
[]
[]
[]
[null,null,null,null,null,null,{"$f":"IFERROR(INDEX(PAGE11.1!H37:H43,MATCH(PAGE10.1!I42,PAGE11.1!G37:G43,0),),\"\")","v":""}]
[null,null,null,null,null,null,null,null,null,null,{"$f":"CONCATENATE(D52,\" \",\"A\")","v":" A"}]
[]
[null,null,null,null,null,"Fonte"]
[]
[null,null,null,null,null,"13,8kV",null,null,null,null,null,{"$f":"G55","v":""}]
[null,null,null,null,null,null,null,null,null,null,null,{"$f":"G52","v":"Se Isolação PVC 70° C (mm²)"}]
[null,null,null,null,null,null,null,"Δ-Y Aterrada",null,null,null,{"$f":"G63","v":""}]
[null,null,null,null,null,null,null,null,null,null,null,{"$f":"G60","v":"Se Isolação EPR/XLPE 90° C (mm²)"}]
[null,null,null,null,null,null,null,{"$f":"CONCATENATE(I42,\" \",\"kVA\")","v":"0 kVA"},null,null,null,{"$f":"\"Eletroduto: \" & J64","v":"Eletroduto: "}]
[null,null,null,null,null,null,null,"13,8kV - 380/220V"]
[null,null,null,null,null,null,null,"13,8/13,2/12,6"]
[]
[]
[]
[]
[]
[]
[]
[]
[]
[]
[]
[]
[]
[]
[null,null,null,null,null,null,null,null,"Edificação"]
[]
[]
[]
[]
[]
[]
[]
[null,null,null,null,null,null,null,null,null,null,null,"UC Vizinho"]
[]
[]
[]
[]
[]
[]
[]
[]
[]
[]
[]
[]
[]
[]
[]
[]
[]
[]
[]
[]
[]
[]
[]
[]
[]
[]
[]
[]
[]
[]
[]
[]
[]
[]
[]
[]
[]
[]
[]
[]
[]
[]
[]
[]
[]
[]
[]
[]
[]
[]
[]
[]
[]
[]
[]
[]
[]
[]
[]
[]
[]
[null,null,"Versão 1.3",null,null,null,null,"Data de Impressão:",null,{"$f":"NOW()","v":"2024-10-04T11:47:26.860"}]
[null,null,null,null,null,null,null,"ART:",null,{"$f":"UPPER(PAGE1.1!G7)","v":""}]
[null,null,null,"ANOTAÇÕES / INFORMAÇÕES ADICIONAIS:"]
[]
[null,null,null,{"$f":"UPPER(IF(ISBLANK(PAGE4.1!D8),\"NADA A DECLARAR.\",PAGE4.1!D8))","v":"NADA A DECLARAR."}]

{"sheet":"PAGE8","index":19,"n_rows":70,"n_cols":10,"rows_kept":70,"cut":false,"hidden":false,"merged":[[12,9,12,10],[9,0,9,2],[9,9,9,10],[10,0,10,1],[10,9,10,10],[11,0,11,1],[11,9,11,10],[1,0,1,3],[1,5,1,9],[2,0,2,1],[3,3,8,3],[4,1,4,2],[8,1,8,2],[13,0,13,2],[13,9,13,10],[14,9,14,10],[15,9,15,10],[18,0,18,3],[18,5,18,9],[19,5,19,6],[23,5,23,6],[27,5,27,6],[30,2,31,2],[31,5,31,6],[33,0,33,3],[34,0,34,1],[38,0,38,1],[39,5,39,6],[42,0,42,1],[49,5,49,6],[49,7,49,8],[49,9,49,10],[50,9,50,10],[51,9,51,10],[52,9,52,10],[53,9,53,10],[54,9,54,10],[57,5,57,6],[57,7,57,8],[57,9,57,10],[58,9,58,10],[59,9,59,10],[60,9,60,10],[61,9,61,10],[62,9,62,10],[68,6,68,7],[69,6,69,7],[65,0,65,3],[65,5,65,9],[66,6,66,7],[67,0,67,1],[67,2,67,3],[67,6,67,7]]}
["GERAL",{"$f":"A50","v":"CDM - 1"},{"$f":"E50","v":"CDM - 2"},{"$f":"E58","v":"CDM - 3"}]
["DIMENSIONAMENTO DOS COMPONENTES"]
["Entrada de Serviço"]
["Dem. Total:",{"$f":"IF(#REF!=B1,B50,IF(#REF!=C1,E51,IF(#REF!=D1,E59,(B31*B32)+J21+E36)))","v":{"$error":"#REF!"}},"kVA","Entrada das UCs","Condomínio","1F",{"$f":"IF(F4=\"3F\",J21,J22)","v":0},{"$f":"IF($G4=0,0,IF($F4=\"1F\",INDEX([2]Tabelas!$P$4:$P$5,MATCH($G4,[2]Tabelas!$L$4:$L$5,1),),INDEX([2]Tabelas!$P$6:$P$9,MATCH($G4,[2]Tabelas!$N$6:$N$9,1),)))","v":0},{"$f":"IF($G4=0,\"\",IF($F4=\"1F\",INDEX([2]Tabelas!$Q$4:$R$5,MATCH($G4,[2]Tabelas!$L$4:$L$5,1),MATCH($J4,[2]Tabelas!$Q$3:$R$3,0)),INDEX([2]Tabelas!$Q$6:$R$9,MATCH($G4,[2]Tabelas!$N$6:$N$9,1),MATCH($J4,[2]Tabelas!$Q$3:$R$3,0))))","v":""},"XLPE"]
["Faixa:",{"$f":"IF($B$4>=[2]Tabelas!$A$5,INDEX([2]Tabelas!$A$5:$A$14,COUNTA([2]Tabelas!$A$5:$A$14)-COUNTIF([2]Tabelas!$A$5:$A$14,\">\"&$B$4),) & \" < De ≤ \" & INDEX([2]Tabelas!$B$5:$B$14,COUNTA([2]Tabelas!$A$5:$A$14)-COUNTIF([2]Tabelas!$A$5:$A$14,\">\"&$B$4),),[2]Tabelas!$A$5 & \" < De ≤ \" & [2]Tabelas!$B$5)","v":{"$error":"#REF!"}},null,null,"Tipo 1",null,null,{"$f":"IF($G5=0,0,IF($F5=\"1F\",INDEX([2]Tabelas!$P$4:$P$5,MATCH($G5,[2]Tabelas!$L$4:$L$5,1),),INDEX([2]Tabelas!$P$6:$P$9,MATCH($G5,[2]Tabelas!$N$6:$N$9,1),)))","v":0},{"$f":"IF($G5=0,\"\",IF($F5=\"1F\",INDEX([2]Tabelas!$Q$4:$R$5,MATCH($G5,[2]Tabelas!$L$4:$L$5,1),MATCH($J5,[2]Tabelas!$Q$3:$R$3,0)),INDEX([2]Tabelas!$Q$6:$R$9,MATCH($G5,[2]Tabelas!$N$6:$N$9,1),MATCH($J5,[2]Tabelas!$Q$3:$R$3,0))))","v":""},"XLPE"]
["Qtd Circuitos:",{"$f":"INDEX([2]Tabelas!$C$5:$C$14,MATCH($B$4,[2]Tabelas!$A$5:$A$14,1),)","v":{"$error":"#REF!"}},{"$f":"IF(B6=1,\"Circuito\",\"Circuitos\")","v":{"$error":"#REF!"}},null,"Tipo 2",null,null,{"$f":"IF($G6=0,0,IF($F6=\"1F\",INDEX([2]Tabelas!$P$4:$P$5,MATCH($G6,[2]Tabelas!$L$4:$L$5,1),),INDEX([2]Tabelas!$P$6:$P$9,MATCH($G6,[2]Tabelas!$N$6:$N$9,1),)))","v":0},{"$f":"IF($G6=0,\"\",IF($F6=\"1F\",INDEX([2]Tabelas!$Q$4:$R$5,MATCH($G6,[2]Tabelas!$L$4:$L$5,1),MATCH($J6,[2]Tabelas!$Q$3:$R$3,0)),INDEX([2]Tabelas!$Q$6:$R$9,MATCH($G6,[2]Tabelas!$N$6:$N$9,1),MATCH($J6,[2]Tabelas!$Q$3:$R$3,0))))","v":""},"XLPE"]
["Disjuntor:",{"$f":"INDEX([2]Tabelas!$I$5:$I$14,COUNTA([2]Tabelas!$A$5:$A$14)-COUNTIF([2]Tabelas!$A$5:$A$14,\">\"&$B$4),)","v":{"$error":"#VALUE!"}},"A",null,"Tipo 3",null,null,{"$f":"IF($G7=0,0,IF($F7=\"1F\",INDEX([2]Tabelas!$P$4:$P$5,MATCH($G7,[2]Tabelas!$L$4:$L$5,1),),INDEX([2]Tabelas!$P$6:$P$9,MATCH($G7,[2]Tabelas!$N$6:$N$9,1),)))","v":0},{"$f":"IF($G7=0,\"\",IF($F7=\"1F\",INDEX([2]Tabelas!$Q$4:$R$5,MATCH($G7,[2]Tabelas!$L$4:$L$5,1),MATCH($J7,[2]Tabelas!$Q$3:$R$3,0)),INDEX([2]Tabelas!$Q$6:$R$9,MATCH($G7,[2]Tabelas!$N$6:$N$9,1),MATCH($J7,[2]Tabelas!$Q$3:$R$3,0))))","v":""},"XLPE"]
["Condutor:",{"$f":"INDEX([2]Tabelas!$D$5:$D$14,COUNTA([2]Tabelas!$A$5:$A$14)-COUNTIF([2]Tabelas!$A$5:$A$14,\">\"&$B$4),)","v":{"$error":"#VALUE!"}},"mm²",null,"Tipo 4",null,null,{"$f":"IF($G8=0,0,IF($F8=\"1F\",INDEX([2]Tabelas!$P$4:$P$5,MATCH($G8,[2]Tabelas!$L$4:$L$5,1),),INDEX([2]Tabelas!$P$6:$P$9,MATCH($G8,[2]Tabelas!$N$6:$N$9,1),)))","v":0},{"$f":"IF($G8=0,\"\",IF($F8=\"1F\",INDEX([2]Tabelas!$Q$4:$R$5,MATCH($G8,[2]Tabelas!$L$4:$L$5,1),MATCH($J8,[2]Tabelas!$Q$3:$R$3,0)),INDEX([2]Tabelas!$Q$6:$R$9,MATCH($G8,[2]Tabelas!$N$6:$N$9,1),MATCH($J8,[2]Tabelas!$Q$3:$R$3,0))))","v":""},"XLPE"]
["Barramento:",{"$f":"INDEX([2]Tabelas!$U$4:$U$15,MATCH($B$4,[2]Tabelas!$T$4:$T$15,1),)","v":{"$error":"#REF!"}},null,null,"Tipo 5",null,null,{"$f":"IF($G9=0,0,IF($F9=\"1F\",INDEX([2]Tabelas!$P$4:$P$5,MATCH($G9,[2]Tabelas!$L$4:$L$5,1),),INDEX([2]Tabelas!$P$6:$P$9,MATCH($G9,[2]Tabelas!$N$6:$N$9,1),)))","v":0},{"$f":"IF($G9=0,\"\",IF($F9=\"1F\",INDEX([2]Tabelas!$Q$4:$R$5,MATCH($G9,[2]Tabelas!$L$4:$L$5,1),MATCH($J9,[2]Tabelas!$Q$3:$R$3,0)),INDEX([2]Tabelas!$Q$6:$R$9,MATCH($G9,[2]Tabelas!$N$6:$N$9,1),MATCH($J9,[2]Tabelas!$Q$3:$R$3,0))))","v":""},"XLPE"]
["ATENDIMENTO AÉREO",null,null,null,"BLOCO","Demanda","Disjuntor","Barramento","Circuitos","Ramal"]
["Ramal de Lig (XLPE):",null,{"$f":"INDEX([2]Tabelas!$AA$3:$AA$11,MATCH($B$4,[2]Tabelas!$Y$3:$Y$11,-1),)","v":{"$error":"#REF!"}},null,null,null,{"$f":"IF($F11=0,\"\",INDEX([2]Tabelas!$I$5:$I$14,COUNTA([2]Tabelas!$A$5:$A$14)-COUNTIF([2]Tabelas!$A$5:$A$14,\">\"&$F11),))","v":""},{"$f":"IF($F11=0,\"\",INDEX([2]Tabelas!$U$4:$U$15,MATCH($F11,[2]Tabelas!$T$4:$T$15,1),))","v":""},{"$f":"IF($F11=0,\"\",INDEX([2]Tabelas!$C$5:$C$14,MATCH($F11,[2]Tabelas!$A$5:$A$14,1),))","v":""},{"$f":"IF($F11=0,\"\",INDEX([2]Tabelas!$D$5:$D$14,COUNTA([2]Tabelas!$A$5:$A$14)-COUNTIF([2]Tabelas!$A$5:$A$14,\">\"&$F11),))","v":""}]
["Poste (DT):",null,{"$f":"INDEX([2]Tabelas!$AB$3:$AB$11,MATCH($B$4,[2]Tabelas!$Y$3:$Y$11,-1),) & \" dAN\"","v":{"$error":"#REF!"}},null,null,null,{"$f":"IF($F12=0,\"\",INDEX([2]Tabelas!$I$5:$I$14,COUNTA([2]Tabelas!$A$5:$A$14)-COUNTIF([2]Tabelas!$A$5:$A$14,\">\"&$F12),))","v":""},{"$f":"IF($F12=0,\"\",INDEX([2]Tabelas!$U$4:$U$15,MATCH($F12,[2]Tabelas!$T$4:$T$15,1),))","v":""},{"$f":"IF($F12=0,\"\",INDEX([2]Tabelas!$C$5:$C$14,MATCH($F12,[2]Tabelas!$A$5:$A$14,1),))","v":""},{"$f":"IF($F12=0,\"\",INDEX([2]Tabelas!$D$5:$D$14,COUNTA([2]Tabelas!$A$5:$A$14)-COUNTIF([2]Tabelas!$A$5:$A$14,\">\"&$F12),))","v":""}]
[null,null,null,null,null,null,{"$f":"IF($F13=0,\"\",INDEX([2]Tabelas!$I$5:$I$14,COUNTA([2]Tabelas!$A$5:$A$14)-COUNTIF([2]Tabelas!$A$5:$A$14,\">\"&$F13),))","v":""},{"$f":"IF($F13=0,\"\",INDEX([2]Tabelas!$U$4:$U$15,MATCH($F13,[2]Tabelas!$T$4:$T$15,1),))","v":""},{"$f":"IF($F13=0,\"\",INDEX([2]Tabelas!$C$5:$C$14,MATCH($F13,[2]Tabelas!$A$5:$A$14,1),))","v":""},{"$f":"IF($F13=0,\"\",INDEX([2]Tabelas!$D$5:$D$14,COUNTA([2]Tabelas!$A$5:$A$14)-COUNTIF([2]Tabelas!$A$5:$A$14,\">\"&$F13),))","v":""}]
["CONDOMÍNIOS",null,null,null,null,null,{"$f":"IF($F14=0,\"\",INDEX([2]Tabelas!$I$5:$I$14,COUNTA([2]Tabelas!$A$5:$A$14)-COUNTIF([2]Tabelas!$A$5:$A$14,\">\"&$F14),))","v":""},{"$f":"IF($F14=0,\"\",INDEX([2]Tabelas!$U$4:$U$15,MATCH($F14,[2]Tabelas!$T$4:$T$15,1),))","v":""},{"$f":"IF($F14=0,\"\",INDEX([2]Tabelas!$C$5:$C$14,MATCH($F14,[2]Tabelas!$A$5:$A$14,1),))","v":""},{"$f":"IF($F14=0,\"\",INDEX([2]Tabelas!$D$5:$D$14,COUNTA([2]Tabelas!$A$5:$A$14)-COUNTIF([2]Tabelas!$A$5:$A$14,\">\"&$F14),))","v":""}]
["Tipo","Demanda","Caixa",null,null,null,{"$f":"IF($F15=0,\"\",INDEX([2]Tabelas!$I$5:$I$14,COUNTA([2]Tabelas!$A$5:$A$14)-COUNTIF([2]Tabelas!$A$5:$A$14,\">\"&$F15),))","v":""},{"$f":"IF($F15=0,\"\",INDEX([2]Tabelas!$U$4:$U$15,MATCH($F15,[2]Tabelas!$T$4:$T$15,1),))","v":""},{"$f":"IF($F15=0,\"\",INDEX([2]Tabelas!$C$5:$C$14,MATCH($F15,[2]Tabelas!$A$5:$A$14,1),))","v":""},{"$f":"IF($F15=0,\"\",INDEX([2]Tabelas!$D$5:$D$14,COUNTA([2]Tabelas!$A$5:$A$14)-COUNTIF([2]Tabelas!$A$5:$A$14,\">\"&$F15),))","v":""}]
["Externo",null,{"$f":"IF(B16=0,\"\",IF(B16<60.1,\"Polifásica\",IF(B16<=75,\"F3\",\"F4\")))","v":""},null,null,null,{"$f":"IF($F16=0,\"\",INDEX([2]Tabelas!$I$5:$I$14,COUNTA([2]Tabelas!$A$5:$A$14)-COUNTIF([2]Tabelas!$A$5:$A$14,\">\"&$F16),))","v":""},{"$f":"IF($F16=0,\"\",INDEX([2]Tabelas!$U$4:$U$15,MATCH($F16,[2]Tabelas!$T$4:$T$15,1),))","v":""},{"$f":"IF($F16=0,\"\",INDEX([2]Tabelas!$C$5:$C$14,MATCH($F16,[2]Tabelas!$A$5:$A$14,1),))","v":""},{"$f":"IF($F16=0,\"\",INDEX([2]Tabelas!$D$5:$D$14,COUNTA([2]Tabelas!$A$5:$A$14)-COUNTIF([2]Tabelas!$A$5:$A$14,\">\"&$F16),))","v":""}]
["Dem. Total",{"$f":"SUM(C31+C35+C39+C43+H20+H24+H28+H32+H40)","v":0},"kVA"]
[]
["Demanda RESIDENCIAL - Área Útil",null,null,null,null,"Demanda CONDOMÍNIO - Carga Instalada"]
[null,"Área","Qtd","Dem.",null,"Parcela a",null,{"$f":"SUM(H22:H23)","v":0},"kVA","Ds"]
["Tipo 1",null,null,{"$f":"IFERROR(INDEX([2]Tabelas!$B$18:$B$56,MATCH(B21,[2]Tabelas!$A$18:$A$56,1),),0)","v":0},null,"Pot (kVA)","Fd","Demanda",null,{"$f":"H20+H24+H28+H32+H40","v":0}]
["Tipo 2",null,null,{"$f":"IFERROR(INDEX([2]Tabelas!$B$18:$B$56,MATCH(B22,[2]Tabelas!$A$18:$A$56,1),),0)","v":0},null,null,null,{"$f":"F22*G22","v":0},null,{"$f":"SUM(F22:F23)+SUMPRODUCT(F26:F27,G26:G27)+SUMPRODUCT(F30:F31,G30:G31)+SUMPRODUCT(F34:F39,H34:H39)*0.736+SUMPRODUCT(F42:F47,G42:G47)","v":0}]
["Tipo 3",null,null,{"$f":"IFERROR(INDEX([2]Tabelas!$B$18:$B$56,MATCH(B23,[2]Tabelas!$A$18:$A$56,1),),0)","v":0},null,null,null,{"$f":"F23*G23","v":0},null,"CI"]
["Tipo 4",null,null,{"$f":"IFERROR(INDEX([2]Tabelas!$B$18:$B$56,MATCH(B24,[2]Tabelas!$A$18:$A$56,1),),0)","v":0},null,"Parcela b",null,{"$f":"SUM(H26:H27)","v":0},"kVA","Caixa"]
["Tipo 5",null,null,{"$f":"IFERROR(INDEX([2]Tabelas!$B$18:$B$56,MATCH(B25,[2]Tabelas!$A$18:$A$56,1),),0)","v":0},null,"Pot (kVA)","Qtd","Demanda","Fd",{"$f":"IF(J21>=60.1,\"F3\",\"\")","v":""}]
["Média / Total",{"$f":"IFERROR(SUMPRODUCT(B21:B25,C21:C25)/C26,0)","v":0},{"$f":"SUM(C21:C25)","v":0},{"$f":"IFERROR(INDEX([2]Tabelas!$B$18:$B$56,MATCH(B26,[2]Tabelas!$A$18:$A$56,1),),0)","v":0},null,null,null,{"$f":"F26*G26*I26","v":0},{"$f":"IFERROR(INDEX([2]Tabelas!$T$20:$T$45,MATCH($G26,[2]Tabelas!$S$20:$S$45,1),),0)","v":0}]
[null,null,null,null,null,null,null,{"$f":"F27*G27*I27","v":0},{"$f":"IFERROR(INDEX([2]Tabelas!$T$20:$T$45,MATCH($G27,[2]Tabelas!$S$20:$S$45,1),),0)","v":0}]
["Fc:",{"$f":"IFERROR(INDEX([2]Tabelas!$D$18:$D$77,MATCH(C26,[2]Tabelas!$C$18:$C$77,1),),0)","v":0},null,null,null,"Parcela f",null,{"$f":"SUM(H30:H31)","v":0},"kVA"]
["Dem. Total:",{"$f":"SUMPRODUCT(C21:C25,D21:D25)","v":0},{"$f":"D26*C26","v":0},null,null,"Pot (kVA)","Qtd","Demanda","Fd"]
[null,null,null,null,null,null,null,{"$f":"F30*G30*I30","v":0},{"$f":"IFERROR(INDEX([2]Tabelas!$I$20:$I$27,MATCH($G30,[2]Tabelas!$H$20:$H$27,1),),0)","v":0}]
["Dr:",{"$f":"$B$29*$B$28","v":0},{"$f":"B31*B32","v":0},null,null,null,null,{"$f":"F31*G31*I31","v":0},{"$f":"IFERROR(INDEX([2]Tabelas!$I$20:$I$27,MATCH($G31,[2]Tabelas!$H$20:$H$27,1),),0)","v":0}]
["Fr:",{"$f":"INDEX([2]Tabelas!$F$18:$F$21,MATCH($B$31,[2]Tabelas!$E$18:$E$21,-1),)","v":1.5},null,null,null,"Parcela g",null,{"$f":"SUMPRODUCT(H34:H39,I34:I39,J34:J39)","v":0},"kVA"]
[null,{"$f":"C29*B28","v":0},null,null,null,"Pot (cv)","Fases","Qtd","Demanda","Fd"]
["Demanda COMERCIAL - Carga Instalada",null,null,null,null,null,null,null,{"$f":"(IFERROR(IF(G34=\"1F\",INDEX([2]Tabelas!$M$19:$M$31,MATCH($F34,[2]Tabelas!$K$19:$K$31,0),),INDEX([2]Tabelas!$Q$19:$Q$42,MATCH($F34,[2]Tabelas!$O$19:$O$42,0),)),$F34)/1000)","v":0},{"$f":"IF(H34=0,0,IF(MAX($I$34:$I$39)<>I34,0.5,(1+0.5*(H34-1))/H34))","v":0}]
["Parcela a",null,{"$f":"SUM(C37:C38)","v":0},"kVA","Dc",null,null,null,{"$f":"(IFERROR(IF(G35=\"1F\",INDEX([2]Tabelas!$M$19:$M$31,MATCH($F35,[2]Tabelas!$K$19:$K$31,0),),INDEX([2]Tabelas!$Q$19:$Q$42,MATCH($F35,[2]Tabelas!$O$19:$O$42,0),)),$F35)/1000)","v":0},0]
["Pot (kVA)","Fd","Demanda",null,{"$f":"C35+C39+C43","v":0},null,null,null,{"$f":"(IFERROR(IF(G36=\"1F\",INDEX([2]Tabelas!$M$19:$M$31,MATCH($F36,[2]Tabelas!$K$19:$K$31,0),),INDEX([2]Tabelas!$Q$19:$Q$42,MATCH($F36,[2]Tabelas!$O$19:$O$42,0),)),$F36)/1000)","v":0},0]
[null,null,{"$f":"A37*B37","v":0},null,{"$f":"SUM(A37:A38)+SUMPRODUCT(A41:A42,B41:B42)+SUMPRODUCT(A45:A47,B45:B47)","v":0},null,null,null,{"$f":"(IFERROR(IF(G37=\"1F\",INDEX([2]Tabelas!$M$19:$M$31,MATCH($F37,[2]Tabelas!$K$19:$K$31,0),),INDEX([2]Tabelas!$Q$19:$Q$42,MATCH($F37,[2]Tabelas!$O$19:$O$42,0),)),$F37)/1000)","v":0},0]
[null,null,{"$f":"A38*B38","v":0},null,"CI",null,null,null,{"$f":"(IFERROR(IF(G38=\"1F\",INDEX([2]Tabelas!$M$19:$M$31,MATCH($F38,[2]Tabelas!$K$19:$K$31,0),),INDEX([2]Tabelas!$Q$19:$Q$42,MATCH($F38,[2]Tabelas!$O$19:$O$42,0),)),$F38)/1000)","v":0},0]
["Parcela f",null,{"$f":"SUM(C41:C42)","v":0},"kVA",null,null,null,null,{"$f":"(IFERROR(IF(G39=\"1F\",INDEX([2]Tabelas!$M$19:$M$31,MATCH($F39,[2]Tabelas!$K$19:$K$31,0),),INDEX([2]Tabelas!$Q$19:$Q$42,MATCH($F39,[2]Tabelas!$O$19:$O$42,0),)),$F39)/1000)","v":0},0]
["Pot (kVA)","Qtd","Demanda","Fd",null,"OUTROS",null,{"$f":"SUM(I42:I47)","v":0},"kVA"]
[null,null,{"$f":"A41*B41*D41","v":0},{"$f":"IFERROR(INDEX([2]Tabelas!$I$20:$I$27,MATCH($B41,[2]Tabelas!$H$20:$H$27,1),),0)","v":0},null,"Pot (kVA)","Qtd","Fd","Demanda"]
[null,null,{"$f":"A42*B42*D42","v":0},{"$f":"IFERROR(INDEX([2]Tabelas!$I$20:$I$27,MATCH($B42,[2]Tabelas!$H$20:$H$27,1),),0)","v":0},null,null,null,null,{"$f":"F42*G42*H42","v":0}]
["OUTROS",null,{"$f":"SUM(D45:D47)","v":0},"kVA",null,null,null,null,0]
["Pot (kVA)","Qtd","Fd","Demanda",null,null,null,null,0]
[null,null,null,{"$f":"A45*B45*C45","v":0},null,null,null,null,0]
[null,null,null,{"$f":"A46*B46*C46","v":0},null,null,null,null,0]
[null,null,null,{"$f":"A47*B47*C47","v":0},null,null,null,null,0]
[]
["Fr",{"$f":"INDEX([2]Tabelas!$F$18:$F$21,MATCH(C49,[2]Tabelas!$E$18:$E$21,-1),)","v":1.5},{"$f":"IFERROR(INDEX([2]Tabelas!$B$18:$B$56,MATCH(B63,[2]Tabelas!$A$18:$A$56,1),),0)*SUM(C52:C55)*C63","v":0},null,"Fr",{"$f":"INDEX([2]Tabelas!$F$18:$F$21,MATCH(E56,[2]Tabelas!$E$18:$E$21,-1),)","v":1.5}]
["CDM - 1",{"$f":"A63+C49*B49","v":0},null,null,"CDM - 2","RESIDENCIAL",null,"COMERCIAL",null,"Condutor"]
["RESIDENCIAL","Área","Qtd",null,{"$f":"F49*E56+H56","v":0},"Área","Qtd","Demanda","Qtd",{"$f":"INDEX([2]Tabelas!$C$5:$C$14,MATCH($E51,[2]Tabelas!$A$5:$A$14,1),)&\"x\"&INDEX([2]Tabelas!$D$5:$D$14,COUNTA([2]Tabelas!$A$5:$A$14)-COUNTIF([2]Tabelas!$A$5:$A$14,\">\"&$E51),) & \"mm²\"","v":{"$error":"#VALUE!"}}]
["Tipo 1",null,null,null,"Tipo 1",null,null,null,null,"Disjuntor"]
["Tipo 2",null,null,null,"Tipo 2",null,null,null,null,{"$f":"INDEX([2]Tabelas!$I$5:$I$14,COUNTA([2]Tabelas!$A$5:$A$14)-COUNTIF([2]Tabelas!$A$5:$A$14,\">\"&$E51),) & \" A\"","v":{"$error":"#VALUE!"}}]
["Tipo 3",null,null,null,"Tipo 3",null,null,null,null,"Barramento"]
["Tipo 4",null,null,null,"Tipo 4",null,null,null,null,{"$f":"INDEX([2]Tabelas!$U$4:$U$15,MATCH($E51,[2]Tabelas!$T$4:$T$15,1),)","v":"19 x 3"}]
["COMERCIAL","Demanda","Qtd",null,{"$f":"IFERROR(INDEX([2]Tabelas!$B$18:$B$56,MATCH(F56,[2]Tabelas!$A$18:$A$56,1),),0)*SUM(G52:G55)*G56","v":0},{"$f":"IFERROR(SUMPRODUCT(F52:F55,G52:G55)/SUM(G52:G55),0)","v":0},{"$f":"IFERROR(INDEX([2]Tabelas!$D$18:$D$77,MATCH(SUM(G52:G55),[2]Tabelas!$C$18:$C$77,1),),0)","v":0},{"$f":"SUMPRODUCT(H52:H55,I52:I55)","v":0}]
["Tipo 1",null,null,null,"Fr",{"$f":"INDEX([2]Tabelas!$F$18:$F$21,MATCH(E64,[2]Tabelas!$E$18:$E$21,-1),)","v":1.5}]
["Tipo 2",null,null,null,"CDM - 3","RESIDENCIAL",null,"COMERCIAL",null,"Condutor"]
["Tipo 3",null,null,null,{"$f":"F57*E64+H64","v":0},"Área","Qtd","Demanda","Qtd",{"$f":"INDEX([2]Tabelas!$C$5:$C$14,MATCH($E59,[2]Tabelas!$A$5:$A$14,1),)&\"x\"&INDEX([2]Tabelas!$D$5:$D$14,COUNTA([2]Tabelas!$A$5:$A$14)-COUNTIF([2]Tabelas!$A$5:$A$14,\">\"&$E59),) & \"mm²\"","v":{"$error":"#VALUE!"}}]
["Tipo 4",null,null,null,"Tipo 1",null,null,null,null,"Disjuntor"]
["Condutor",{"$f":"INDEX([2]Tabelas!$C$5:$C$14,MATCH($B50,[2]Tabelas!$A$5:$A$14,1),)&\"x\"&INDEX([2]Tabelas!$D$5:$D$14,COUNTA([2]Tabelas!$A$5:$A$14)-COUNTIF([2]Tabelas!$A$5:$A$14,\">\"&$B50),) & \"mm²\"","v":{"$error":"#VALUE!"}},"Barramento",".","Tipo 2",null,null,null,null,{"$f":"INDEX([2]Tabelas!$I$5:$I$14,COUNTA([2]Tabelas!$A$5:$A$14)-COUNTIF([2]Tabelas!$A$5:$A$14,\">\"&$E59),) & \" A\"","v":{"$error":"#VALUE!"}}]
["Disjuntor",{"$f":"INDEX([2]Tabelas!$I$5:$I$14,COUNTA([2]Tabelas!$A$5:$A$14)-COUNTIF([2]Tabelas!$A$5:$A$14,\">\"&$B50),) & \" A\"","v":{"$error":"#VALUE!"}},{"$f":"INDEX([2]Tabelas!$U$4:$U$15,MATCH($B50,[2]Tabelas!$T$4:$T$15,1),)","v":"19 x 3"},null,"Tipo 3",null,null,null,null,"Barramento"]
[{"$f":"SUMPRODUCT(B57:B60,C57:C60)","v":0},{"$f":"IFERROR(SUMPRODUCT(B52:B55,C52:C55)/SUM(C52:C55),0)","v":0},{"$f":"IFERROR(INDEX([2]Tabelas!$D$18:$D$77,MATCH(SUM(C52:C55),[2]Tabelas!$C$18:$C$77,1),),0)","v":0},null,"Tipo 4",null,null,null,null,{"$f":"INDEX([2]Tabelas!$U$4:$U$15,MATCH($E59,[2]Tabelas!$T$4:$T$15,1),)","v":"19 x 3"}]
[null,null,null,null,{"$f":"IFERROR(INDEX([2]Tabelas!$B$18:$B$56,MATCH(F64,[2]Tabelas!$A$18:$A$56,1),),0)*SUM(G60:G63)*G64","v":0},{"$f":"IFERROR(SUMPRODUCT(F60:F63,G60:G63)/SUM(G60:G63),0)","v":0},{"$f":"IFERROR(INDEX([2]Tabelas!$D$18:$D$77,MATCH(SUM(G60:G63),[2]Tabelas!$C$18:$C$77,1),),0)","v":0},{"$f":"SUMPRODUCT(H60:H63,I60:I63)","v":0}]
[]
["CÂMARA DE TRANSFORMAÇÃO - DETALHES",null,null,null,null,"SUBESTAÇÃO PARTICULAR"]
[null,null,null,null,null,"POTÊNCIA",300,null,"DISJUNTOR",{"$f":"INDEX([2]Tabelas!$AF$6:$AF$12,MATCH(G67,Pot_Trafo,0),1)","v":500}]
["Porta - Acesso de pessoas",null,"2,10 x 1,05",null,null,"CABO","BITOLA",null,"DUTO PVC","DUTO FG"]
[null,null,null,null,null,"PVC",{"$f":"INDEX([2]Tabelas!$AG$6:$AG$12,MATCH(G67,Pot_Trafo,0),1) & \" mm²\"","v":"2x[3x150(120)] mm²"},null,{"$f":"INDEX([2]Tabelas!$AH$6:$AH$12,MATCH(G67,Pot_Trafo,0),1) & \" mm\"","v":"2x75 mm"},{"$f":"INDEX([2]Tabelas!$AI$6:$AI$12,MATCH(G67,Pot_Trafo,0),1) & \" mm\"","v":"2x65 mm"}]
[null,null,null,null,null,"XLPE/EPR",{"$f":"INDEX([2]Tabelas!$AJ$6:$AJ$12,MATCH(G67,Pot_Trafo,0),1) & \" mm²\"","v":"2x[3x95(70)] mm²"},null,{"$f":"INDEX([2]Tabelas!$AK$6:$AK$12,MATCH(G67,Pot_Trafo,0),1) & \" mm\"","v":"2x60 mm"},{"$f":"INDEX([2]Tabelas!$AL$6:$AL$12,MATCH(G67,Pot_Trafo,0),1) & \" mm\"","v":"2x50 mm"}]

{"sheet":"PAGE11.1","index":20,"n_rows":77,"n_cols":38,"rows_kept":77,"cut":false,"hidden":true,"merged":[[16,7,16,8],[16,10,16,12],[16,14,16,16],[16,18,16,19],[17,7,17,8],[17,18,17,19],[14,0,14,1],[14,2,14,3],[14,4,14,5],[15,0,15,1],[15,2,15,3],[15,4,15,5],[1,15,2,15],[1,16,1,17],[1,20,1,21],[1,29,2,30],[3,31,4,31],[1,31,2,31],[1,32,1,37],[2,25,10,25],[2,32,2,37],[3,29,4,29],[3,30,4,30],[5,29,11,29],[3,32,4,32],[3,33,3,34],[3,35,4,35],[3,36,3,37],[0,0,0,8],[0,10,0,17],[0,19,0,22],[0,24,0,27],[0,29,0,37],[1,0,2,1],[1,2,1,8],[1,10,2,10],[1,11,1,12],[1,13,1,14],[2,2,3,2],[2,3,3,3],[2,4,3,4],[2,5,3,5],[2,6,3,6],[2,7,2,8]]}
["DIMENSIONAMENTO ENTRADA DE SERVIÇO_ANEXO II - Tabela 02 (DIS-NOR-053)",null,null,null,null,null,null,null,null,null,"DIMENSIONAMENTO DAS ENTRADAS INDIVIDUAIS _ANEXO II - Tabela 03 (DIS-NOR-053)",null,null,null,null,null,null,null,null,"BARRAMENTO COBRE _ ANEXO II - Tabela 04 (DIS-NOR-053)",null,null,null,null,"ATENDIMENTO AÉREO _ ANEXO II - Tabela 06 (DIS-NOR-053)",null,null,null,null,"CONDUTOR DE BT_ANEXO I - Tabela 14 (DIS-NOR-036)"]
["Demanda Máxima da Edificação (kVA)",null,"Ramal de Entrada de Subterrâneo",null,null,null,null,null,null,null,"CAT","CARGA INSTALADA",null,"DEMANDA",null,"DISJUNTOR","CABO",null,null,"Demanda","Dimensões",null,"Corrente",null,"Demanda","Tensão","Ramal de Ligação XLPE","Poste DT",null,"Transformador",null,"Proteção","Condutores de BT"]
[null,null,"Quantidade Circuitos","Seção (mm²) XLPE","Duto PEAD","Duto\nAço","Corrente Total (A)","Disjuntor Geral",null,null,null,"De","Até","De","Até",null,"PVC","XLPE",null,"(kVA)","(mm)","(pol)","(A)",null,135,"380/220","AL 3x70(70)",200,null,null,null,null,"Em eletroduto rígido"]
["Mín","Máx",null,null,null,null,null,"Carcaça","Corrente",null,"M2",0,8,null,null,40,10,6,null,0,"19 x 3",null,208,null,115,null,"AL 3x70(70)",200,null,"Tensão secundária (V)","Potência nominal","Disjuntor (A)","Isolação PVC 70º C (mm²)","Eletroduto diâmetro nominal (mm)",null,"Isolação EPR/XLPE 90º C (mm²)","Eletroduto diâmetro nominal (mm)"]
[0,{"$f":"A6-1","v":46},1,25,110,100,85,"D100",63,null,"M3",8.1,15,null,null,63,25,16,null,41,"25 x 3",null,250,null,98,null,"AL 3x50(50)",200,null,null,null,null,null,"PVC","AÇO",null,"PVC","AÇO"]
[47,{"$f":"A7-1","v":54},1,35,110,100,103,"D100",80,null,"T5",null,null,0,32,50,25,16,null,75,"25 x 5",null,340,null,75,null,"AL 3x35(35)",200,null,"380/220",30,50,"3x10(10)",32,25,"3x10(10)",32,25]
[55,67,1,50,110,100,122,"D100",100,null,"T6",null,null,32.1,42,63,35,25,null,105,"30 x 5",null,449,null,67,null,"AL 3x25(25)",90,null,null,45,70,"3x25(25)",32,25,"3x16(16)",32,25]
[68,75,1,50,110,100,122,"D100",100,null,"T7",null,null,42.1,60,100,70,50,null,208,"40 x 5",null,460,null,54,null,"AL 3x25(25)",90,null,null,75,125,"3x50(25)",40,32,"3x35(25)",40,32]
[76,98,1,95,110,100,179,"D225",150,null,"T8",null,null,60.1,75,125,70,70,null,260,"50 x 5",null,595,null,46,null,"AL 3x25(25)",90,null,null,112.5,175,"3x95(70)",60,50,"3x70(35)",50,40]
[99,115,2,70,110,100,242,"D225",175,null,null,null,null,null,null,null,null,null,null,347,"40 x 10",null,994,null,38,null,"AL 3x25(25)",90,null,null,150,250,"3x150(70)",75,65,"3x95(50)",60,50]
[116,150,1,185,110,100,258,"D225",200,null,null,null,null,null,null,null,null,null,null,433,"50 x 10",null,1312,null,0,null,"AL 3x25(25)",90,null,null,225,350,"3x240(120)",85,80,"3x150(70)",75,65]
[151,191,2,150,110,100,368,"D400",300,null,null,null,null,null,null,null,null,null,null,520,"60 x 10",null,1640,null,null,null,null,null,null,null,300,500,"2x[3x150(120)]","2x75","2x65","2x[3x95(70)]","2x60","2x50"]
[192,225,2,240,110,100,477,"D400",350,null,null,null,null,null,null,null,null,null,null,606,"80 x 10",null,1968]
[225.1,9999,"-x-",{"$f":"C14","v":"-x-"},{"$f":"D14","v":"-x-"},"-x-","-x-","-x-","-x-",null,null,null,null,null,null,null,null,null,null,779,"100 x 10",null,2625]
["DEMANDA DO APARTAMENTO",null,"FATOR DE COINCIDÊNCIA",null,"FATOR DE SEGURANÇA",null,null,null,null,null,null,null,null,null,null,null,null,null,null,952,"120 x 10",null,3281]
["AN I - Quadro 1 (DIS-NOR-053)",null,"AN I - Quadro 2 (DIS-NOR-053)",null,"AN I - Quadro 3 (DIS-NOR-053)"]
["Área Útil (m²)","Demanda (kVA)","Nº Aptos","Fc","Dr (kVA)","Fr",null,"FD - Parcela f (Ar-cond)",null,null,"ANEXO I - Tabela 15 (DIS-NOR-030)",null,null,null,"ANEXO I - Tabela 16 (DIS-NOR-030)",null,null,null,"FD - Parcela b (Chuveiro)"]
[0.01,1,1,1,999999,1,null,"ANEXO I - Tabela 10 (DIS-NOR-030)",null,null,"cv","W","VA",null,"cv","W","VA",null,"ANEXO I - Tabela 5 (DIS-NOR-030)"]
[41,1.05,{"$f":"C18+1","v":2},0.98,100,1.2,null,"Qtd","Fd",null,0.25,420,660,null,0.33,390,650,null,"Qtd","Fd"]
[{"$f":"A19+5","v":46},1.1599999999999999,{"$f":"C19+1","v":3},0.97299999999999998,50,1.3,null,1,1,null,0.33,510,770,null,0.5,580,870,null,1,1]
[{"$f":"A20+5","v":51},1.26,4,0.97,25,1.5,null,{"$f":"H20+10","v":11},0.9,null,0.5,790,1180,null,0.75,830,1260,null,2,1]
[56,1.36,5,0.96799999999999997,null,null,null,{"$f":"H21+10","v":21},0.82,null,0.75,900,1340,null,1,1050,1520,null,3,0.84]
[61,1.47,6,0.96599999999999997,null,null,null,{"$f":"H22+10","v":31},0.8,null,1,1140,1560,null,1.5,1540,2170,null,4,0.76]
[66,1.57,7,0.9657,null,null,null,{"$f":"H23+10","v":41},0.77,null,1.5,1670,2350,null,2,1950,2700,null,5,0.7]
[71,1.67,8,0.96499999999999997,null,null,null,{"$f":"H24+10","v":51},0.75,null,2,2170,2970,null,3,2950,4040,null,6,0.65]
[76,1.76,9,0.96450000000000002,null,null,null,76,{"$f":"I25","v":0.75},null,3,3220,4070,null,4,3720,5030,null,7,0.6]
[81,1.86,10,0.96399999999999997,null,null,null,101,{"$f":"I26","v":0.75},null,5,5110,6160,null,5,4510,6020,null,8,0.56999999999999995]
[86,1.96,11,0.94730000000000003,null,null,null,null,null,null,7.5,7070,8840,null,7.5,6570,8650,null,9,0.54]
[91,2.06,12,0.93330000000000002,null,null,null,null,null,null,10,9310,11640,null,10,8890,11540,null,10,0.52]
[96,2.16,13,0.92149999999999999,null,null,null,null,null,null,12.5,11580,14940,null,12.5,10850,14090,null,11,0.49]
[101,2.35,14,0.91139999999999999,null,null,null,null,null,null,15,13720,16940,null,15,12820,16650,null,12,0.48]
[{"$f":"A31+10","v":111},2.54,15,0.90269999999999995,null,null,null,null,null,null,null,null,null,null,20,17010,22100,null,13,0.46]
[{"$f":"A32+10","v":121},2.73,16,0.89500000000000002,null,null,null,null,null,null,null,null,null,null,25,20920,25830,null,14,0.45]
[131,2.91,17,0.88819999999999999,null,null,null,null,null,null,null,null,null,null,30,25030,30520,null,15,0.44]
[141,3.06,18,0.88219999999999998,null,null,null,null,null,null,null,null,null,null,40,33380,39740,null,16,0.43]
[151,3.28,19,0.87680000000000002,null,null,null,null,null,null,null,null,null,null,50,40930,48730,null,17,0.42]
[161,3.47,20,0.872,null,"220/380",30,"1H",50,"1.1/4”",null,null,null,null,60,49420,58150,null,18,0.41]
[171,3.65,21,0.85899999999999999,null,"220/380",45,"2H",70,"1.1/4”",null,null,null,null,75,61440,72280,null,19,0.4]
[181,3.83,22,0.84770000000000001,null,"220/380",75,"2H",125,"1.1/2”",null,null,null,null,100,81230,95560,null,20,0.4]
[191,4.01,23,0.83699999999999997,null,"220/380",112.5,"3H",175,"2”",null,null,null,null,125,100670,117050,null,21,0.39]
[201,4.3600000000000003,24,0.82750000000000001,null,"220/380",150,"5H",250,"2.1/2”",null,null,null,null,150,120090,141290,null,22,0.39]
[{"$f":"A41+20","v":221},4.72,25,0.81840000000000002,null,"220/380",225,"6K",350,"2x2”",null,null,null,null,200,161650,190180,null,23,0.39]
[{"$f":"A42+20","v":241},5.07,26,0.81,null,"220/380",300,"6K",500,"2x2.1/2”",null,null,null,null,null,null,null,null,24,0.38]
[261,5.42,27,0.80259999999999998,null,null,null,null,null,null,null,null,null,null,null,null,null,null,25,0.38]
[281,5.76,28,0.7954,null,null,null,null,null,null,null,null,null,null,null,null,null,null,26,0.38]
[301,6.61,29,0.78900000000000003]
[{"$f":"A46+50","v":351},7.45,30,0.78269999999999995]
[{"$f":"A47+50","v":401},8.2799999999999994,31,0.77680000000000005]
[451,9.1,32,0.77159999999999995]
[501,9.91,33,0.76639999999999997]
[551,10.71,34,0.76180000000000003]
[{"$f":"A51+50","v":601},11.51,35,0.7571]
[651,12.3,36,0.75280000000000002]
[{"$f":"A53+50","v":701},13.86,37,0.74890000000000001]
[{"$f":"A54+100","v":801},15.4,38,0.74450000000000005]
[{"$f":"A55+100","v":901},16.93,39,0.74109999999999998]
[null,null,{"$f":"C56+1","v":40},0.73799999999999999]
[null,null,41,0.73460000000000003]
[null,null,42,0.73170000000000002]
[null,null,43,0.72889999999999999]
[null,null,44,0.72599999999999998]
[null,null,45,0.72309999999999997]
[null,null,46,0.71960000000000002]
[null,null,47,0.71619999999999995]
[null,null,48,0.71289999999999998]
[null,null,49,0.70979999999999999]
[null,null,50,0.70679999999999998]
[null,null,51,0.70389999999999997]
[null,null,52,0.70169999999999999]
[null,null,53,0.69850000000000001]
[null,null,54,0.69599999999999995]
[null,null,55,0.69350000000000001]
[null,null,56,0.69110000000000005]
[null,null,57,0.68879999999999997]
[null,null,58,0.68659999999999999]
[null,null,59,0.68440000000000001]
[null,null,60,0.68230000000000002]

{"sheet":"BASE TRAFO","index":21,"n_rows":8,"n_cols":1,"rows_kept":8,"cut":false,"hidden":true,"merged":[]}
["TRAFOS"]
[30]
[45]
[75]
[112.5]
[150]
[225]
[300]