{"text_format":"1","workbook":"xlsx","n_sheets":19,"sheets":["Início","Formulário","QDINC","QD01","QD02","QD03","QD04","QD05","DadosMedições","Medições","Ramal_Aerero_Poste de transição","Ramal","Ramal_subterraneo_redesub","Ramal_subterraneo_posterede","Rede_aerea_pontalete","Diagrama","Tabelas","ORIENTAÇÕES","Painel madeiras"],"not_rendered":{"charts":0,"images":21,"macros":1,"external_links":0,"defined_names":11,"comments":0,"pivot_tables":0},"unopened":[],"bounds":{"document_bytes":16777216,"sheet_cells":100000,"rows_first":2000,"rows_last":500,"rows_between":2000,"halvings":0,"cell_chars":16384,"cell_head_chars":4096},"cells_cut":0,"cells_raw":0,"read":"whole","date_system":"1900"}

{"sheet":"Início","index":0,"n_rows":22,"n_cols":8,"rows_kept":22,"cut":false,"hidden":false,"merged":[[36,5,37,5],[36,6,37,6],[37,0,37,4],[1,4,1,7],[21,2,21,6],[6,2,6,7],[7,2,11,7],[13,2,13,6],[15,2,15,6]]}
[]
[null,null,null,null,"Painel Coletivo Simplificado"]
[]
[null,null,"Olá,"]
[null,null,"Seja bem-vindo(a)!"]
[]
{"$rows_left_out":17}
{"sheet":"Formulário","index":1,"n_rows":40,"n_cols":16,"rows_kept":40,"cut":false,"hidden":false,"merged":[[0,5,0,15],[3,1,5,4],[3,5,5,15],[1,1,2,15],[7,1,7,6],[7,7,7,9],[7,10,7,15],[6,1,6,4],[6,5,6,15],[10,1,10,6],[10,7,10,9],[10,10,10,15],[12,7,12,9],[12,1,12,6],[12,10,12,15],[11,1,11,6],[11,7,11,9],[11,10,11,15],[8,1,8,6],[9,10,9,15],[8,7,8,9],[8,10,8,15],[9,1,9,6],[9,7,9,9],[13,1,13,6],[13,7,13,9],[13,10,13,15],[18,1,18,4],[18,5,18,12],[18,14,18,15],[17,1,17,15],[15,1,15,6],[15,7,15,9],[15,10,15,15],[14,7,14,9],[14,10,14,15],[16,1,16,6],[16,7,16,9],[16,10,16,15],[14,1,14,6],[19,1,19,4],[19,5,19,15],[21,8,21,10],[25,5,25,15],[20,1,20,4],[20,5,20,7],[20,8,20,10],[20,11,20,15],[25,1,25,4],[21,1,21,4],[21,5,21,7],[22,1,22,4],[22,5,22,13],[21,11,21,15],[23,1,23,4],[23,5,23,10],[23,11,23,13],[23,14,23,15],[24,1,24,15],[26,1,26,4],[26,5,26,15],[27,1,27,4],[27,5,27,7],[27,8,27,10],[27,11,27,15],[29,1,29,4],[29,5,29,7],[29,8,29,10],[29,11,29,15],[28,1,28,4],[28,5,28,7],[28,8,28,10],[28,11,28,15],[30,1,30,15],[35,1,35,15],[39,1,42,7],[31,1,34,15],[38,8,42,15],[36,8,37,15],[36,1,38,7]]}
[null,null,null,null,null,"Painel Coletivo - Interligação Neoenergia Brasília"]
[null,"Dados Básicos do Serviço"]
[]
[null,"Resumo do Serviço :",null,null,null,"PM "]
[]
[]
{"$rows_left_out":35}
{"sheet":"QDINC","index":2,"n_rows":31,"n_cols":5,"rows_kept":31,"cut":false,"hidden":false,"merged":[[1,2,1,4],[2,1,3,4],[28,1,28,3],[29,1,29,3],[30,1,30,4],[23,1,23,3],[24,1,24,3],[25,1,25,3],[26,1,26,3],[27,1,27,3]]}
[]
[null,null,"Painel Coletivo - Interligação Neoenergia Brasília"]
[null,"QD CARGAS MEDIÇÃO DE INCÊNDIO"]
[]
[null,"Descrição dos Equipamentos ","Carga\n(W)","Fator Potência","Carda demandada (kVA)"]
[null,"Motor trifásico",20000,1,{"$f":"IFERROR(C6/D6/1000,\"\")","v":20}]
{"$rows_left_out":26}
{"sheet":"QD01","index":3,"n_rows":33,"n_cols":12,"rows_kept":33,"cut":false,"hidden":false,"merged":[[58,3,58,4],[60,3,60,4],[61,3,61,4],[53,3,53,4],[54,3,54,4],[55,3,55,4],[56,3,56,4],[57,3,57,4],[47,3,47,4],[48,3,48,4],[50,3,50,4],[51,3,51,4],[52,3,52,4],[42,3,42,4],[43,3,43,4],[44,3,44,4],[45,3,45,4],[46,3,46,4],[79,3,79,4],[22,1,22,3],[74,3,74,4],[75,3,75,4],[76,3,76,4],[77,3,77,4],[78,3,78,4],[69,3,69,4],[70,3,70,4],[71,3,71,4],[72,3,72,4],[73,3,73,4],[64,3,64,4],[65,3,65,4],[66,3,66,4],[67,3,67,4],[68,3,68,4],[31,3,31,4],[32,3,32,4],[33,3,33,4],[34,3,34,4],[35,3,35,4],[36,3,36,4],[37,3,37,4],[38,3,38,4],[39,3,39,4],[40,3,40,4],[41,3,41,4],[49,3,49,4],[59,3,59,4],[62,3,62,4],[63,3,63,4],[3,11,3,17],[4,11,4,17],[1,2,1,4],[2,1,2,4],[30,1,30,4],[24,1,24,3],[25,1,25,3],[26,1,26,3],[27,1,27,3],[29,1,29,4],[28,1,28,3],[23,1,23,3]]}
[]
[null,null,"Painel Coletivo - Interligação Neoenergia Brasília"]
[null,"QD CARGAS TIPO 01"]
[null,"Descrição dos equipamentos","Carga\n(W)","Fator Potência","Carda demandada (kVA)",null,null,null,null,null,null,"          OBSERVAÇÕES"]
[null,"Iluminação",150,1,{"$f":"IFERROR(C5/D5/1000,\"\")","v":0.15}]
[null,"Tomadas",1000,1,{"$f":"IFERROR(C6/D6/1000,\"\")","v":1}]
{"$rows_left_out":28}
{"sheet":"QD02","index":4,"n_rows":34,"n_cols":12,"rows_kept":34,"cut":false,"hidden":false,"merged":[[61,3,61,4],[50,3,50,4],[51,3,51,4],[52,3,52,4],[53,3,53,4],[54,3,54,4],[55,3,55,4],[56,3,56,4],[57,3,57,4],[58,3,58,4],[59,3,59,4],[60,3,60,4],[49,3,49,4],[38,3,38,4],[39,3,39,4],[40,3,40,4],[41,3,41,4],[42,3,42,4],[43,3,43,4],[44,3,44,4],[45,3,45,4],[46,3,46,4],[47,3,47,4],[48,3,48,4],[37,3,37,4],[26,1,26,3],[27,1,27,3],[28,1,28,3],[29,1,29,4],[30,1,30,4],[31,3,31,4],[32,3,32,4],[33,3,33,4],[34,3,34,4],[35,3,35,4],[36,3,36,4],[3,11,3,17],[4,11,4,17],[25,1,25,3],[1,2,1,4],[2,1,2,4],[22,1,22,3],[23,1,23,3],[24,1,24,3]]}
[]
[null,null,"Painel Coletivo - Interligação Neoenergia Brasília"]
[null,"QD CARGAS TIPO 02"]
[null,"Descrição dos equipamentos","Carga\n(W)","Fator Potência","Carda demandada (kVA)",null,null,null,null,null,null,"          OBSERVAÇÕES"]
[null,"Iluminação",600,1,{"$f":"IFERROR(C5/D5/1000,\"\")","v":0.6}]
[null,"Tomadas",1100,1,{"$f":"IFERROR(C6/D6/1000,\"\")","v":1.1000000000000001}]
{"$rows_left_out":29}
{"sheet":"QD03","index":5,"n_rows":42,"n_cols":12,"rows_kept":42,"cut":false,"hidden":false,"merged":[[61,3,61,4],[50,3,50,4],[51,3,51,4],[52,3,52,4],[53,3,53,4],[54,3,54,4],[55,3,55,4],[56,3,56,4],[57,3,57,4],[58,3,58,4],[59,3,59,4],[60,3,60,4],[49,3,49,4],[38,3,38,4],[39,3,39,4],[40,3,40,4],[41,3,41,4],[42,3,42,4],[43,3,43,4],[44,3,44,4],[45,3,45,4],[46,3,46,4],[47,3,47,4],[48,3,48,4],[37,3,37,4],[26,1,26,3],[27,1,27,3],[28,1,28,3],[29,1,29,4],[30,1,30,4],[31,3,31,4],[32,3,32,4],[33,3,33,4],[34,3,34,4],[35,3,35,4],[36,3,36,4],[3,11,3,17],[4,11,4,17],[25,1,25,3],[1,2,1,4],[2,1,2,4],[22,1,22,3],[23,1,23,3],[24,1,24,3]]}
[]
[null,null,"Painel Coletivo - Interligação Neoenergia Brasília"]
[null,"QD CARGAS TIPO 03"]
[null,"Descrição dos equipamentos","Carga\n(W)","Fator Potência","Carda demandada (kVA)",null,null,null,null,null,null,"          OBSERVAÇÕES"]
[null,"Iluminação",50,1,{"$f":"IFERROR(C5/D5/1000,\"\")","v":0.05}]
[null,"Tomadas",600,1,{"$f":"IFERROR(C6/D6/1000,\"\")","v":0.6}]
{"$rows_left_out":37}
{"sheet":"QD04","index":6,"n_rows":32,"n_cols":12,"rows_kept":32,"cut":false,"hidden":false,"merged":[[61,3,61,4],[50,3,50,4],[51,3,51,4],[52,3,52,4],[53,3,53,4],[54,3,54,4],[55,3,55,4],[56,3,56,4],[57,3,57,4],[58,3,58,4],[59,3,59,4],[60,3,60,4],[49,3,49,4],[38,3,38,4],[39,3,39,4],[40,3,40,4],[41,3,41,4],[42,3,42,4],[43,3,43,4],[44,3,44,4],[45,3,45,4],[46,3,46,4],[47,3,47,4],[48,3,48,4],[37,3,37,4],[26,1,26,3],[27,1,27,3],[28,1,28,3],[29,1,29,4],[30,1,30,4],[31,3,31,4],[32,3,32,4],[33,3,33,4],[34,3,34,4],[35,3,35,4],[36,3,36,4],[3,11,3,17],[4,11,4,17],[25,1,25,3],[1,2,1,4],[2,1,2,4],[22,1,22,3],[23,1,23,3],[24,1,24,3]]}
[]
[null,null,"Painel Coletivo - Interligação Neoenergia Brasília"]
[null,"QD CARGAS TIPO 04"]
[null,"Descrição dos equipamentos","Carga\n(W)","Fator Potência","Carda demandada (kVA)",null,null,null,null,null,null,"          OBSERVAÇÕES"]
[null,null,null,null,{"$f":"IFERROR(C5/D5/1000,\"\")","v":""}]
[null,null,null,null,{"$f":"IFERROR(C6/D6/1000,\"\")","v":""}]
{"$rows_left_out":27}
{"sheet":"QD05","index":7,"n_rows":32,"n_cols":12,"rows_kept":32,"cut":false,"hidden":false,"merged":[[61,3,61,4],[50,3,50,4],[51,3,51,4],[52,3,52,4],[53,3,53,4],[54,3,54,4],[55,3,55,4],[56,3,56,4],[57,3,57,4],[58,3,58,4],[59,3,59,4],[60,3,60,4],[49,3,49,4],[38,3,38,4],[39,3,39,4],[40,3,40,4],[41,3,41,4],[42,3,42,4],[43,3,43,4],[44,3,44,4],[45,3,45,4],[46,3,46,4],[47,3,47,4],[48,3,48,4],[37,3,37,4],[26,1,26,3],[27,1,27,3],[28,1,28,3],[29,1,29,4],[30,1,30,4],[31,3,31,4],[32,3,32,4],[33,3,33,4],[34,3,34,4],[35,3,35,4],[36,3,36,4],[3,11,3,17],[4,11,4,17],[25,1,25,3],[1,2,1,4],[2,1,2,4],[22,1,22,3],[23,1,23,3],[24,1,24,3]]}
[]
[null,null,"Painel Coletivo - Interligação Neoenergia Brasília"]
[null,"QD CARGAS TIPO 05"]
[null,"Descrição dos equipamentos","Carga\n(W)","Fator Potência","Carda demandada (kVA)",null,null,null,null,null,null,"          OBSERVAÇÕES"]
[null,null,null,null,{"$f":"IFERROR(C5/D5/1000,\"\")","v":""}]
[null,null,null,null,{"$f":"IFERROR(C6/D6/1000,\"\")","v":""}]
{"$rows_left_out":27}
{"sheet":"DadosMedições","index":8,"n_rows":75,"n_cols":15,"rows_kept":75,"cut":false,"hidden":true,"merged":[]}
[null,null,null,"Esta tela não deve ser exibida ao projetista"]
[]
[null,"QD",null,"Identificação da unidade","Pavimento","Carga inst. (kW)",null,"Demanda (KVA)","Ponto trifásico ","TIPO","FASES",null,"Disjuntor ","Condutores","Caixa"]
[null,"QDINC",null,"Incêndio",null,{"$f":"QDINC!C23","v":20000},null,{"$f":"QDINC!E25","v":10},{"$f":"QDINC!E26","v":"SIM"},{"$f":"QDINC!E27","v":"T1"},{"$f":"VLOOKUP(J4,Tabelas!$A$2:$G$10,2,FALSE)","v":"TRIF "},null,{"$f":"_xlfn.CONCAT(\"DISJ \",K4,\" \",QDINC!$E$29,\"A\")","v":"DISJ TRIF  32A"},{"$f":"VLOOKUP(J4,CABOS,4,FALSE)","v":"3#6(6)T#6"},"P1"]
["Número","QD",null,"Identificação da unidade","Pavimento","Carga inst. (kW)","Carga Inst kVA","Demanda (KVA)","Ponto trifásico ","TIPO","FASES",null,"Disjuntor ","Condutores","Painel de madeira"]
[{"$f":"IF(D6=\" \",\" \",COUNT($A$5:A5)+1)","v":1},"QD01",1,{"$f":"IF(_xlfn.CONCAT('QD01'!B33,\"\",'QD01'!C33)=\"\",\"\",_xlfn.CONCAT('QD01'!B33,\"\",'QD01'!C33))","v":"Serviço1"},{"$f":"'QD01'!D33","v":"Térreo"},{"$f":"'QD01'!C22","v":1250},{"$f":"'QD01'!E22","v":1.25},{"$f":"'QD01'!E24","v":0.625},{"$f":"'QD01'!$E$25","v":"NÃO"},{"$f":"'QD01'!$E$26","v":"M1"},{"$f":"VLOOKUP(J6,Tabelas!$A$2:$G$10,2,FALSE)","v":"MONOF "},{"$f":"IF(K6=\"MONOF \",1,IF(K6=\"BIF \",2,IF(K6=\"TRIF \",3,\"\")))","v":1},{"$f":"_xlfn.CONCAT(\"DISJ \",K6,\" \",'QD01'!$E$28,\"A\")","v":"DISJ MONOF  32A"},{"$f":"VLOOKUP(J6,CABOS,4,FALSE)","v":"1#6(6)T#6"}]
{"$rows_left_out":70}
{"sheet":"Medições","index":9,"n_rows":104,"n_cols":14,"rows_kept":104,"cut":false,"hidden":false,"merged":[[1,3,1,9],[2,3,3,14],[1,10,1,14],[15,3,16,14],[5,3,5,8],[7,3,7,8],[8,3,8,8],[12,3,12,8],[6,11,6,12],[5,11,5,12],[13,13,14,14],[13,12,14,12],[13,11,14,11],[13,10,14,10],[13,9,14,9],[17,13,17,14],[18,13,18,14],[12,13,12,14],[13,3,14,8],[7,10,7,13],[19,13,19,14],[20,13,20,14],[21,13,21,14],[22,13,22,14],[23,13,23,14],[24,13,24,14],[25,13,25,14],[26,13,26,14],[27,13,27,14],[28,13,28,14],[29,13,29,14],[30,13,30,14],[31,13,31,14],[32,13,32,14],[33,13,33,14],[40,13,40,14],[41,13,41,14],[42,13,42,14],[43,13,43,14],[34,13,34,14],[35,13,35,14],[36,13,36,14],[37,13,37,14],[38,13,38,14],[54,13,54,14],[55,13,55,14],[56,13,56,14],[57,13,57,14],[10,3,11,14],[49,13,49,14],[50,13,50,14],[51,13,51,14],[52,13,52,14],[53,13,53,14],[44,13,44,14],[45,13,45,14],[46,13,46,14],[47,13,47,14],[48,13,48,14],[39,13,39,14]]}
[]
[null,null,null,null,null,null,null,null,null,null,"Painel Coletivo - Interligação Neoenergia Brasília"]
[null,null,null,"Dados Básicos do Painel de Medição"]
[]
[]
[null,null,null,"Tipo de painel:",null,null,null,null,null,"Madeira",null,"Localização do PM",null,"TERREO "]
{"$rows_left_out":99}
{"sheet":"Ramal_Aerero_Poste de transição","index":10,"n_rows":124,"n_cols":94,"rows_kept":124,"cut":false,"hidden":false,"merged":[[38,85,40,87],[47,85,51,87],[127,1,134,82],[123,1,126,82],[85,57,87,57],[88,1,91,82],[14,85,17,86],[33,85,37,86],[7,85,10,86],[21,85,24,86],[30,85,32,87],[1,1,1,82],[2,1,3,82],[5,36,5,53],[5,24,5,35],[1,84,1,90],[2,84,2,90]]}
[]
[null,"Painel Coletivo  - Interligação Neoenergia Brasília ",null,null,null,null,null,null,null,null,null,null,null,null,null,null,null,null,null,null,null,null,null,null,null,null,null,null,null,null,null,null,null,null,null,null,null,null,null,null,null,null,null,null,null,null,null,null,null,null,null,null,null,null,null,null,null,null,null,null,null,null,null,null,null,null,null,null,null,null,null,null,null,null,null,null,null,null,null,null,null,null,null,null,"LEGENDA "]
[null,"PLANTA SITUAÇÃO/LOCALIZAÇÃO",null,null,null,null,null,null,null,null,null,null,null,null,null,null,null,null,null,null,null,null,null,null,null,null,null,null,null,null,null,null,null,null,null,null,null,null,null,null,null,null,null,null,null,null,null,null,null,null,null,null,null,null,null,null,null,null,null,null,null,null,null,null,null,null,null,null,null,null,null,null,null,null,null,null,null,null,null,null,null,null,null,null,"Posicione os itens na planta de situação"]
[]
[]
[null,null,null,null,null,null,null,null,null,null,null,null,null,null,null,null,null,null,null,null,null,null,null,null,"TIPO DE TERRENO: ",null,null,null,null,null,null,null,null,null,null,null,"Meio",null,null,null,null,null,null,null,null,null,null,null,null,null,null,null,null,null,null,null,null,null,null,null,null,null,null,null,null,null,null,null,null,null,null,null,null,null,null,null,null,null,null,null,null,null,null,null,null,"CAIXA CB1"]
{"$rows_left_out":119}
{"sheet":"Ramal","index":11,"n_rows":27,"n_cols":7,"rows_kept":27,"cut":false,"hidden":false,"merged":[[1,1,2,3],[6,1,6,4],[6,5,6,6],[8,1,8,4],[10,1,10,4],[10,5,10,6],[1,4,2,9],[3,1,4,9],[12,1,12,4],[12,5,12,6],[26,1,26,4],[26,5,26,6],[14,1,15,4],[14,5,15,6],[17,1,17,4],[17,5,17,6],[19,1,19,4],[19,5,19,6],[21,1,21,4],[21,5,21,6],[23,1,24,4],[23,5,24,6]]}
[]
[null,null,null,null,"Painel Coletivo - Interligação Neoenergia Brasília"]
[]
[null,"Parâmetros  para dimensionamento do Ramal de Entrada"]
[]
[]
{"$rows_left_out":22}
{"sheet":"Ramal_subterraneo_redesub","index":12,"n_rows":124,"n_cols":94,"rows_kept":124,"cut":false,"hidden":false,"merged":[[47,85,51,87],[85,57,87,57],[88,1,91,82],[123,1,126,82],[127,1,134,82],[38,85,40,87],[1,1,1,82],[1,84,1,90],[2,1,3,82],[2,84,2,90],[5,24,5,35],[5,36,5,53],[7,85,10,86],[14,85,17,86],[21,85,24,86],[30,85,32,87],[33,85,37,86]]}
[]
[null,"Painel Coletivo  - Interligação Neoenergia Brasília ",null,null,null,null,null,null,null,null,null,null,null,null,null,null,null,null,null,null,null,null,null,null,null,null,null,null,null,null,null,null,null,null,null,null,null,null,null,null,null,null,null,null,null,null,null,null,null,null,null,null,null,null,null,null,null,null,null,null,null,null,null,null,null,null,null,null,null,null,null,null,null,null,null,null,null,null,null,null,null,null,null,null,"LEGENDA "]
[null,"PLANTA SITUAÇÃO/LOCALIZAÇÃO",null,null,null,null,null,null,null,null,null,null,null,null,null,null,null,null,null,null,null,null,null,null,null,null,null,null,null,null,null,null,null,null,null,null,null,null,null,null,null,null,null,null,null,null,null,null,null,null,null,null,null,null,null,null,null,null,null,null,null,null,null,null,null,null,null,null,null,null,null,null,null,null,null,null,null,null,null,null,null,null,null,null,"Posicione os itens na planta de situação"]
[]
[]
[null,null,null,null,null,null,null,null,null,null,null,null,null,null,null,null,null,null,null,null,null,null,null,null,"TIPO DE TERRENO: ",null,null,null,null,null,null,null,null,null,null,null,"Quarteirão",null,null,null,null,null,null,null,null,null,null,null,null,null,null,null,null,null,null,null,null,null,null,null,null,null,null,null,null,null,null,null,null,null,null,null,null,null,null,null,null,null,null,null,null,null,null,null,null,"CAIXA CB1"]
{"$rows_left_out":119}
{"sheet":"Ramal_subterraneo_posterede","index":13,"n_rows":124,"n_cols":86,"rows_kept":124,"cut":false,"hidden":false,"merged":[[47,85,51,87],[85,57,87,57],[88,1,91,82],[123,1,126,82],[127,1,134,82],[38,85,40,87],[1,1,1,82],[1,84,1,90],[2,1,3,82],[2,84,2,90],[5,24,5,35],[5,36,5,53],[7,85,10,86],[14,85,17,86],[21,85,24,86],[30,85,32,87],[33,85,37,86]]}
[]
[null,"Painel Coletivo  - Interligação Neoenergia Brasília ",null,null,null,null,null,null,null,null,null,null,null,null,null,null,null,null,null,null,null,null,null,null,null,null,null,null,null,null,null,null,null,null,null,null,null,null,null,null,null,null,null,null,null,null,null,null,null,null,null,null,null,null,null,null,null,null,null,null,null,null,null,null,null,null,null,null,null,null,null,null,null,null,null,null,null,null,null,null,null,null,null,null,"LEGENDA "]
[null,"PLANTA SITUAÇÃO/LOCALIZAÇÃO",null,null,null,null,null,null,null,null,null,null,null,null,null,null,null,null,null,null,null,null,null,null,null,null,null,null,null,null,null,null,null,null,null,null,null,null,null,null,null,null,null,null,null,null,null,null,null,null,null,null,null,null,null,null,null,null,null,null,null,null,null,null,null,null,null,null,null,null,null,null,null,null,null,null,null,null,null,null,null,null,null,null,"Posicione os itens na planta de situação"]
[]
[]
[null,null,null,null,null,null,null,null,null,null,null,null,null,null,null,null,null,null,null,null,null,null,null,null,"TIPO DE TERRENO: ",null,null,null,null,null,null,null,null,null,null,null,"Quarteirão",null,null,null,null,null,null,null,null,null,null,null,null,null,null,null,null,null,null,null,null,null,null,null,null,null,null,null,null,null,null,null,null,null,null,null,null,null,null,null,null,null,null,null,null,null,null,null,null,"CAIXA CB1"]
{"$rows_left_out":119}
{"sheet":"Rede_aerea_pontalete","index":14,"n_rows":124,"n_cols":94,"rows_kept":124,"cut":false,"hidden":false,"merged":[[47,85,51,87],[85,57,87,57],[88,1,91,82],[123,1,126,82],[127,1,134,82],[38,85,40,87],[1,1,1,82],[1,84,1,90],[2,1,3,82],[2,84,2,90],[5,24,5,35],[5,36,5,53],[7,85,10,86],[14,85,17,86],[21,85,24,86],[30,85,32,87],[33,85,37,86]]}
[]
[null,"Painel Coletivo  - Interligação Neoenergia Brasília ",null,null,null,null,null,null,null,null,null,null,null,null,null,null,null,null,null,null,null,null,null,null,null,null,null,null,null,null,null,null,null,null,null,null,null,null,null,null,null,null,null,null,null,null,null,null,null,null,null,null,null,null,null,null,null,null,null,null,null,null,null,null,null,null,null,null,null,null,null,null,null,null,null,null,null,null,null,null,null,null,null,null,"LEGENDA "]
[null,"PLANTA SITUAÇÃO/LOCALIZAÇÃO",null,null,null,null,null,null,null,null,null,null,null,null,null,null,null,null,null,null,null,null,null,null,null,null,null,null,null,null,null,null,null,null,null,null,null,null,null,null,null,null,null,null,null,null,null,null,null,null,null,null,null,null,null,null,null,null,null,null,null,null,null,null,null,null,null,null,null,null,null,null,null,null,null,null,null,null,null,null,null,null,null,null,"Posicione os itens na planta de situação"]
[]
[]
[null,null,null,null,null,null,null,null,null,null,null,null,null,null,null,null,null,null,null,null,null,null,null,null,"TIPO DE TERRENO: ",null,null,null,null,null,null,null,null,null,null,null,"Quarteirão",null,null,null,null,null,null,null,null,null,null,null,null,null,null,null,null,null,null,null,null,null,null,null,null,null,null,null,null,null,null,null,null,null,null,null,null,null,null,null,null,null,null,null,null,null,null,null,null,"CAIXA CB1"]
{"$rows_left_out":119}
{"sheet":"Diagrama","index":15,"n_rows":60,"n_cols":32,"rows_kept":60,"cut":false,"hidden":false,"merged":[[6,23,7,25],[13,12,13,16],[1,1,1,15],[27,27,28,30],[31,27,32,30],[2,1,3,39],[1,16,1,39],[10,28,10,32],[7,31,7,38],[17,31,18,38],[32,31,33,38],[29,31,30,38],[38,31,39,38],[25,31,26,38],[21,31,22,38],[40,4,42,9],[15,27,16,30],[19,27,20,30],[23,27,24,30],[37,27,38,30],[34,27,35,30],[19,12,23,14],[25,12,29,13],[35,31,36,38]]}
[]
[null,null,null,null,null,null,null,null,null,null,null,null,null,null,null,null,"Painel Coletivo - Interligação Neoenergia Brasília"]
[null,"DIAGRAMA UNIFILAR"]
[]
[]
[null,null,null,null,null,null,null,null,null,null,null,null,null,null,null,null,null,null,null,null,null,null,null,{"$f":"CONCATENATE(QDINC!E29,\"A\")","v":"32A"}]
{"$rows_left_out":55}
{"sheet":"Tabelas","index":16,"n_rows":41,"n_cols":26,"rows_kept":41,"cut":false,"hidden":true,"merged":[[31,0,31,8],[28,19,28,21],[13,19,13,20],[8,19,8,27],[11,0,11,8],[20,0,20,8],[23,0,23,8]]}
[null,null,"Tabelas de medições mono e bifáfico"]
["TIPO","FASE","Carga instalada","cabo","disjuntor 1","disjuntor 2"]
["M1","MONOF ",8,"1#6(6)T#6",32,35]
["M2","MONOF ",11,"1#10(10)T#10",40,50]
["B1","BIF ",15,"2#6(6)T#6",32,35]
["B2","BIF ",22,"2#10(10)T#10",40,50]
{"$rows_left_out":36}
{"sheet":"ORIENTAÇÕES","index":17,"n_rows":25,"n_cols":7,"rows_kept":25,"cut":false,"hidden":false,"merged":[[4,1,19,14],[20,1,23,14],[24,1,31,14],[1,1,1,5],[1,6,1,14],[2,1,3,14]]}
[]
[null,null,null,null,null,null,"Orientações Esquema Vertical e Layout do PM "]
[null,"Orientações painel de medição"]
[]
[null,"Encaminhar o layout do PM em anexo aos arquivos, seguindo as orientações abaixo;\n\n1-  A caixa ou painel de medidor mais alta do centro de medição deve ser instalada com sua face superior a uma altura máxima de 2 m em relação ao piso acabado. \n2- A caixa ou painel de medidor mais baixa do centro de medição deve ser instalada com sua face inferior a uma altura mínima de 0,20 m em relação ao piso acabado. \n3- Cada uma das U.C. constituintes do(s) centro(s) de medição deve ser identificada, sequencialmente, da esquerda para a direita, obedecendo sempre a ordem de cima para baixo.\nObs.Para centro de medição em policarbonato, os condutores, tanto de fase quanto de neutro, dos ramais de medidores que saem da caixa de distribuição devem identificar a unidade consumidora por intermédio de anilhas plásticas fixadas nos próprios condutores.\n4- Dimensões das caixas de distribuição para painel em madeira repeitando a tabela 20 da NTD 6.07. \n5- Dimensões dos painéis de madeira respeitando a tabela 21 da NTD 6.07.\n6- Acrescentar as vistas: Frontal interna, Corte lateral e Frontal externa.\n7- Acrescentando as legendas referentes ao tipo de caixa, ao copex metálico(entrando pelo furo da esquerda), disjuntor utilizado e numeração dos apt´s.\n8- Representar junto ao painel o eletorduto que se segue para o aterramento, e o eletroduto de entrada."]
[]
{"$rows_left_out":20}
{"sheet":"Painel madeiras","index":18,"n_rows":46,"n_cols":4,"rows_kept":46,"cut":false,"hidden":true,"merged":[]}
[]
[]
[]
[]
[]
[]
{"$rows_left_out":40}