{"text_format":"1","workbook":"xlsx","n_sheets":19,"sheets":["Início","Formulário","QDINC","QD01","QD02","QD03","QD04","QD05","DadosMedições","Medições","Ramal_Aerero_Poste de transição","Ramal","Ramal_subterraneo_redesub","Ramal_subterraneo_posterede","Rede_aerea_pontalete","Diagrama","Tabelas","ORIENTAÇÕES","Painel madeiras"],"not_rendered":{"charts":0,"images":21,"macros":1,"external_links":0,"defined_names":11,"comments":0,"pivot_tables":0},"unopened":[],"bounds":{"document_bytes":16777216,"sheet_cells":100000,"rows_first":2000,"rows_last":500,"rows_between":2000,"halvings":0,"cell_chars":16384,"cell_head_chars":4096},"cells_cut":0,"cells_raw":0,"read":"whole","date_system":"1900"}

{"sheet":"Início","index":0,"n_rows":22,"n_cols":8,"rows_kept":22,"cut":false,"hidden":false,"merged":[[36,5,37,5],[36,6,37,6],[37,0,37,4],[1,4,1,7],[21,2,21,6],[6,2,6,7],[7,2,11,7],[13,2,13,6],[15,2,15,6]]}
[]
[null,null,null,null,"Painel Coletivo Simplificado"]
[]
[null,null,"Olá,"]
[null,null,"Seja bem-vindo(a)!"]
[]
[null,null,"Esse é um formulário desenvolvido pela Neoenergia Brasília, para simplificar a apresentação de projetos de Painel Coletivo - Interligação Neoenergia Brasília, para rede de baixa tensão. Norma NTD 6.07."]
[null,null,"Navegue pelo formulário, seguindo as orientações e preenchendo as informações solicitadas, ao final, ser-lhe-á apresentado um resumo das instalações."]
[]
[]
[]
[]
[]
[null,null,"O processo é simples e rápido!"]
[]
[null,null,"Pronto(a) para iniciar o preenchimento?"]
[]
[]
[]
[]
[]
[null,null,"*Nota: Compatível com Excel 2013 e versões superiores",null,null,null,null,"Ver. 1.0"]

{"sheet":"Formulário","index":1,"n_rows":40,"n_cols":16,"rows_kept":40,"cut":false,"hidden":false,"merged":[[0,5,0,15],[3,1,5,4],[3,5,5,15],[1,1,2,15],[7,1,7,6],[7,7,7,9],[7,10,7,15],[6,1,6,4],[6,5,6,15],[10,1,10,6],[10,7,10,9],[10,10,10,15],[12,7,12,9],[12,1,12,6],[12,10,12,15],[11,1,11,6],[11,7,11,9],[11,10,11,15],[8,1,8,6],[9,10,9,15],[8,7,8,9],[8,10,8,15],[9,1,9,6],[9,7,9,9],[13,1,13,6],[13,7,13,9],[13,10,13,15],[18,1,18,4],[18,5,18,12],[18,14,18,15],[17,1,17,15],[15,1,15,6],[15,7,15,9],[15,10,15,15],[14,7,14,9],[14,10,14,15],[16,1,16,6],[16,7,16,9],[16,10,16,15],[14,1,14,6],[19,1,19,4],[19,5,19,15],[21,8,21,10],[25,5,25,15],[20,1,20,4],[20,5,20,7],[20,8,20,10],[20,11,20,15],[25,1,25,4],[21,1,21,4],[21,5,21,7],[22,1,22,4],[22,5,22,13],[21,11,21,15],[23,1,23,4],[23,5,23,10],[23,11,23,13],[23,14,23,15],[24,1,24,15],[26,1,26,4],[26,5,26,15],[27,1,27,4],[27,5,27,7],[27,8,27,10],[27,11,27,15],[29,1,29,4],[29,5,29,7],[29,8,29,10],[29,11,29,15],[28,1,28,4],[28,5,28,7],[28,8,28,10],[28,11,28,15],[30,1,30,15],[35,1,35,15],[39,1,42,7],[31,1,34,15],[38,8,42,15],[36,8,37,15],[36,1,38,7]]}
[null,null,null,null,null,"Painel Coletivo - Interligação Neoenergia Brasília"]
[null,"Dados Básicos do Serviço"]
[]
[null,"Resumo do Serviço :",null,null,null,"PM "]
[]
[]
[null,"Tipo de Serviço:",null,null,null,"Ligação Nova - Instalação de Painel Coletivo"]
[null,"Trata-se de único ramal de ligação?",null,null,null,null,null,"Sim",null,null,{"$f":"IF(H8=\"Sim\",\"OK\",IF(H8=\"Não\",\"Reprovado! Não pode haver 2 ramais de ligação na mesma propriedade!\",\"\"))","v":"OK"}]
[null,"Formulário de Declaração de Carga e Demanda anexada e devidamente preenchido?",null,null,null,null,null,"Sim",null,null,{"$f":"IF(H9=\"Sim\",\"OK\",IF(H9=\"Não\",\"Reprovado! Formulário deverá ser enviado!\",\"\"))","v":"OK"}]
[null,"Respeitadas os afastamentos minimos das edificações e divisas? Norma NTD 6.07",null,null,null,null,null,"Sim",null,null,{"$f":"IF(H10=\"Sim\",\"OK\",IF(H10=\"Não\",\"Reprovado! Todas as distâncias deverão ser respeitadas\",\"\"))","v":"OK"}]
[null,"As informações apresentadas foram validadas por meio de vistoria no local?",null,null,null,null,null,"Sim",null,null,{"$f":"IF(H11=\"Sim\",\"OK\",IF(H11=\"Não\",\"Reprovado! Deverá efetuar levantamento no local!\",\"\"))","v":"OK"}]
[null,"Existe gerador proposto nas instalações?",null,null,null,null,null,"Não",null,null,{"$f":"IF(H12=\"Não\",\"OK\",IF(H12=\"Sim\",\"Anexar diagrama unifilar contendo o ponto de instalação do gerador. Observar itens da NTD 6.07.\",\"\"))","v":"OK"}]
[null,"O painel está intalado dentro dos limites da propriedade?",null,null,null,null,null,"Sim",null,null,{"$f":"IF(H13=\"Não\",\"Reprovado! O painel de medição deve ficar dentro dos limites do lote!\",IF(H13=\"Sim\",\"OK\",\"\"))","v":"OK"}]
[null,"Enviada ART/TRT/Outro (Projeto, Aterramento...): propriedade?",null,null,null,null,null,"Sim",null,null,{"$f":"IF(H14=\"Sim\",\"OK\",IF(H14=\"Não\",\"Reprovado!\",\"\"))","v":"OK"}]
[null,"O empreendimento possui mais de 6 medições com no máximo 75kW de carga instalada cada uma?",null,null,null,null,null,"Sim",null,null,{"$f":"IF(H15=\"Sim\",\"OK\",IF(H15=\"Não\",\"Reprovado! Em caso de carga instalada acima de 75kW o fornecimento deve ser feito em média tensão !\",\"\"))","v":"OK"}]
[null,"O empreendimento possui medição de incêndio?",null,null,null,null,null,"Sim",null,null,{"$f":"IF(H16=\"Não\",\"OK\",IF(H16=\"Sim\",\"A medição de incêndio deverá ser instalada em caixa P1 separada do painel.\",\"\"))","v":"A medição de incêndio deverá ser instalada em caixa P1 separada do painel."}]
[null,"O empreendimento possui 2 ou mais medições acima de 75kW de carga instalada cada e a demanda geral é superior a 65kVA?",null,null,null,null,null,"Não",null,null,{"$f":"IF(H17=\"Não\",\"OK\",IF(H17=\"Sim\",\"Reprovado! Caso o empreendimento tenha a maioria das unidades com carga até 75kW, é permitido apenas uma unidade com demanda acima de 65kVA !\",\"\"))","v":"OK"}]
[null,"Dados da Unidade Consumidora"]
[null,"Responsável Pela U.C.",null,null,null,"RODRIGO CASTRO ",null,null,null,null,null,null,null,"UC:"]
[null,"E-mail",null,null,null,"rodrigo.castro@neoenergia.com"]
[null,"RG:",null,null,null,3789456,null,null,"CPF/CNPJ:",null,null,"010.524.654.77"]
[null,"Telefone fixo",null,null,null,6136281626,null,null,"Celular:",null,null,61991877275]
[null,"Endereço",null,null,null,"QR 417 CONJUNTO F",null,null,null,null,null,null,null,null,"Nº.",62]
[null,"Localidade",null,null,null,"SANTA MARIA ",null,null,null,null,null,"Unidade Federativa ",null,null,"DF"]
[null,"Dados do Responsável Técnico"]
[null,"Responsável Técnico:",null,null,null,"PAULO VINICIUS VIEIRA BORGES "]
[null,"E-mail",null,null,null,"paulo.vinicius@neoenergia.com"]
[null,"Telefone fixo",null,null,null,null,null,null,"Celular:",null,null,61991877275]
[null,"Conselho de Classe:",null,null,null,"CREA",null,null,"Nº CREA/CFT:",null,null,"02005014766"]
[null,"Formação",null,null,null,"ENGENHIERO ELETRICISTA ",null,null,"Nº da ART/TRT:",null,null,47862045699]
[null,"Observações/Comentários adicionais"]
[null,"Todas as normas da NEOENERGIA Brasília estão sendo observadas, sobretudo a norma NTD 6.07. Condições técnicas e de segurança estão ok."]
[]
[]
[]
[null,"Declaração e Assinatura"]
[null,"Declaro verdadeiras todas as inforamções prestadas nesse memorial.",null,null,null,null,null,null,"Assinatura do Responsável técnico"]
[]
[]
[null,"_________________/_____/_____/_____"]

{"sheet":"QDINC","index":2,"n_rows":31,"n_cols":5,"rows_kept":31,"cut":false,"hidden":false,"merged":[[1,2,1,4],[2,1,3,4],[28,1,28,3],[29,1,29,3],[30,1,30,4],[23,1,23,3],[24,1,24,3],[25,1,25,3],[26,1,26,3],[27,1,27,3]]}
[]
[null,null,"Painel Coletivo - Interligação Neoenergia Brasília"]
[null,"QD CARGAS MEDIÇÃO DE INCÊNDIO"]
[]
[null,"Descrição dos Equipamentos ","Carga\n(W)","Fator Potência","Carda demandada (kVA)"]
[null,"Motor trifásico",20000,1,{"$f":"IFERROR(C6/D6/1000,\"\")","v":20}]
[null,null,null,null,{"$f":"IFERROR(C7/D7/1000,\"\")","v":""}]
[null,null,null,null,""]
[null,null,null,null,""]
[null,null,null,null,""]
[null,null,null,null,""]
[null,null,null,null,""]
[null,null,null,null,""]
[null,null,null,null,""]
[null,null,null,null,""]
[null,null,null,null,""]
[null,null,null,null,""]
[null,null,null,null,""]
[null,null,null,null,""]
[null,null,null,null,""]
[null,null,null,null,""]
[null,null,null,null,""]
[null,"TOTAL",{"$f":"SUM(C6:C22)","v":20000},null,{"$f":"SUM(E6:E22)","v":20}]
[null,"FATOR DE DEMANDA ",null,null,0.5]
[null,"DEMANDA DA UNIDADE",null,null,{"$f":"E24*E23","v":10}]
[null,"POSSUI CARGA TRIFÁSICA",null,null,{"$f":"IF((COUNTIF(B6:B22,\"Motor trifásico\")+COUNTIF(B6:B22,\"Tomada trifásica\"))>0,\"SIM\",\"NÃO\")","v":"SIM"}]
[null,"TIPO DE MEDIÇÃO",null,null,{"$f":"IF(AND(C23<=8000,E26=\"NÃO\"),\"M1\",IF(AND(C23<11000,E26=\"NÃO\"),\"M2\",IF(AND(C23<=15000,E26=\"NÃO\"),\"B1\",IF(AND(C23<=22000,E26=\"NÃO\"),\"B2\",IF(E25<=23,\"T1\",IF(E25<=33,\"T2\",IF(E25<=45,\"T3\",IF(E25<=65,\"T4\",\"DEMANDA NÃO PERMITIDA\"))))))))","v":"T1"}]
[null,"CORRENTE(A)",null,null,{"$f":"E25/0.38/SQRT(3)","v":15.193428136569098}]
[null,"DISJUNTOR",null,null,32]
[null,"CONDUTORES",null,null,{"$f":"IF(E27=\"M1\",Tabelas!D3,IF(E27=\"M2\",Tabelas!D4,IF(E27=\"B1\",Tabelas!D5,IF(E27=\"B2\",Tabelas!D6,IF(E27=\"T1\",Tabelas!D7,IF(E27=\"T2\",Tabelas!D8,IF(E27=\"T3\",Tabelas!D9,IF(E27=\"T4\",Tabelas!D10,\"\"))))))))","v":"3#6(6)T#6"}]
[null,"*Observação: caso o projetista altere a bitola de algum cabo de medição por motivo de queda de tensão, deverá anexar memória de cálculo para cada uma das medições. Indicando o novo cabo adotado. "]

{"sheet":"QD01","index":3,"n_rows":33,"n_cols":12,"rows_kept":33,"cut":false,"hidden":false,"merged":[[58,3,58,4],[60,3,60,4],[61,3,61,4],[53,3,53,4],[54,3,54,4],[55,3,55,4],[56,3,56,4],[57,3,57,4],[47,3,47,4],[48,3,48,4],[50,3,50,4],[51,3,51,4],[52,3,52,4],[42,3,42,4],[43,3,43,4],[44,3,44,4],[45,3,45,4],[46,3,46,4],[79,3,79,4],[22,1,22,3],[74,3,74,4],[75,3,75,4],[76,3,76,4],[77,3,77,4],[78,3,78,4],[69,3,69,4],[70,3,70,4],[71,3,71,4],[72,3,72,4],[73,3,73,4],[64,3,64,4],[65,3,65,4],[66,3,66,4],[67,3,67,4],[68,3,68,4],[31,3,31,4],[32,3,32,4],[33,3,33,4],[34,3,34,4],[35,3,35,4],[36,3,36,4],[37,3,37,4],[38,3,38,4],[39,3,39,4],[40,3,40,4],[41,3,41,4],[49,3,49,4],[59,3,59,4],[62,3,62,4],[63,3,63,4],[3,11,3,17],[4,11,4,17],[1,2,1,4],[2,1,2,4],[30,1,30,4],[24,1,24,3],[25,1,25,3],[26,1,26,3],[27,1,27,3],[29,1,29,4],[28,1,28,3],[23,1,23,3]]}
[]
[null,null,"Painel Coletivo - Interligação Neoenergia Brasília"]
[null,"QD CARGAS TIPO 01"]
[null,"Descrição dos equipamentos","Carga\n(W)","Fator Potência","Carda demandada (kVA)",null,null,null,null,null,null,"          OBSERVAÇÕES"]
[null,"Iluminação",150,1,{"$f":"IFERROR(C5/D5/1000,\"\")","v":0.15}]
[null,"Tomadas",1000,1,{"$f":"IFERROR(C6/D6/1000,\"\")","v":1}]
[null,"Motor",100,1,0.1,null,null,null,null,null,null,"PODERÃO SER CADASTRADOS 5 QUADROS DE CARGAS DISTINTOS "]
[null,null,null,null,"",null,null,null,null,null,null,"NO QD01  PODERÃO SER CADASTRADAS- 20 UNIDADES; NO QD02- 20 UNIDADES"]
[null,null,null,null,"",null,null,null,null,null,null,"NO QD03 - 10 UNIDADES; NO QD04 - 10 UNIDADES ;E NO QD05 - 10 UNIDADES "]
[null,null,null,null,""]
[null,null,null,null,""]
[null,null,null,null,""]
[null,null,null,null,""]
[null,null,null,null,""]
[null,null,null,null,""]
[null,null,null,null,""]
[null,null,null,null,""]
[null,null,null,null,""]
[null,null,null,null,""]
[null,null,null,null,""]
[null,null,null,null,""]
[null,"TOTAL",{"$f":"SUM(C5:C21)","v":1250},null,{"$f":"SUM(E5:E21)","v":1.25}]
[null,"FATOR DE DEMANDA ",null,null,0.5]
[null,"DEMANDA DA UNIDADE",null,null,{"$f":"E23*E22","v":0.625}]
[null,"POSSUI CARGA TRIFÁSICA",null,null,{"$f":"IF((COUNTIF(B5:B21,\"Motor trifásico\")+COUNTIF(B5:B21,\"Tomada trifásica\"))>0,\"SIM\",\"NÃO\")","v":"NÃO"}]
[null,"TIPO DE MEDIÇÃO",null,null,{"$f":"IF(AND(C22<=8000,E25=\"NÃO\"),\"M1\",IF(AND(C22<=11000,E25=\"NÃO\"),\"M2\",IF(AND(C22<=15000,E25=\"NÃO\"),\"B1\",IF(AND(C22<=22000,E25=\"NÃO\"),\"B2\",IF(E24<=23,\"T1\",IF(E24<=33,\"T2\",IF(E24<=45,\"T3\",IF(E24<=65,\"T4\",\"DEMANDA NÃO PERMITIDA\"))))))))","v":"M1"}]
[null,"CORRENTE",null,null,{"$f":"IF(OR(E26=\"M1\",E26=\"M2\"),E24/0.22,IF(OR(E26=\"b1\",E26=\"b2\"),E24/0.22/2,IF(OR(E26=\"t1\",E26=\"t2\",E26=\"T3\",E26=\"t4\"),E24/0.38/SQRT(3))))","v":2.8409090909090908}]
[null,"DISJUNTOR",null,null,32]
[null,"CONDUTORES",null,null,{"$f":"IF(E26=\"M1\",Tabelas!D3,IF(E26=\"M2\",Tabelas!D4,IF(E26=\"B1\",Tabelas!D5,IF(E26=\"B2\",Tabelas!D6,IF(E26=\"T1\",Tabelas!D7,IF(E26=\"T2\",Tabelas!D8,IF(E26=\"T3\",Tabelas!D9,IF(E26=\"T4\",Tabelas!D10,\"\"))))))))","v":"1#6(6)T#6"}]
[null,"*Observação: caso o projetista altere a bitola de algum cabo de medição por motivo de queda de tensão, deverá anexar memória de cálculo para cada uma das medições. Indicando o novo cabo adotado. "]
[null,"UNIDADES CONSUMIDORAS TIPO 01"]
[null,"Tipo ","Nº","Pavimento"]
[null,"Serviço",1,"Térreo"]

{"sheet":"QD02","index":4,"n_rows":34,"n_cols":12,"rows_kept":34,"cut":false,"hidden":false,"merged":[[61,3,61,4],[50,3,50,4],[51,3,51,4],[52,3,52,4],[53,3,53,4],[54,3,54,4],[55,3,55,4],[56,3,56,4],[57,3,57,4],[58,3,58,4],[59,3,59,4],[60,3,60,4],[49,3,49,4],[38,3,38,4],[39,3,39,4],[40,3,40,4],[41,3,41,4],[42,3,42,4],[43,3,43,4],[44,3,44,4],[45,3,45,4],[46,3,46,4],[47,3,47,4],[48,3,48,4],[37,3,37,4],[26,1,26,3],[27,1,27,3],[28,1,28,3],[29,1,29,4],[30,1,30,4],[31,3,31,4],[32,3,32,4],[33,3,33,4],[34,3,34,4],[35,3,35,4],[36,3,36,4],[3,11,3,17],[4,11,4,17],[25,1,25,3],[1,2,1,4],[2,1,2,4],[22,1,22,3],[23,1,23,3],[24,1,24,3]]}
[]
[null,null,"Painel Coletivo - Interligação Neoenergia Brasília"]
[null,"QD CARGAS TIPO 02"]
[null,"Descrição dos equipamentos","Carga\n(W)","Fator Potência","Carda demandada (kVA)",null,null,null,null,null,null,"          OBSERVAÇÕES"]
[null,"Iluminação",600,1,{"$f":"IFERROR(C5/D5/1000,\"\")","v":0.6}]
[null,"Tomadas",1100,1,{"$f":"IFERROR(C6/D6/1000,\"\")","v":1.1000000000000001}]
[null,"Tomadas",1000,1,1,null,null,null,null,null,null,"PODERÃO SER CADASTRADOS 5 QUADROS DE CARGAS DISTINTOS "]
[null,"Ar-condiconado",1000,1,1,null,null,null,null,null,null,"NO QD01  PODERÃO SER CADASTRASDAS- 20 UNIDADES; NO QD02- 20 UNIDADES"]
[null,"Ar-condiconado",1000,1,1,null,null,null,null,null,null,"NO QD03 - 10 UNIDADES; NO QD04 - 10 UNIDADES ;E NO QD05 - 10 UNIDADES "]
[null,"Tomada Trifásica",370,1,0.37]
[null,null,null,null,""]
[null,null,null,null,""]
[null,null,null,null,""]
[null,null,null,null,""]
[null,null,null,null,""]
[null,null,null,null,""]
[null,null,null,null,""]
[null,null,null,null,""]
[null,null,null,null,""]
[null,null,null,null,""]
[null,null,null,null,""]
[null,"TOTAL",{"$f":"SUM(C5:C21)","v":5070},null,{"$f":"SUM(E5:E21)","v":5.07}]
[null,"FATOR DE DEMANDA ",null,null,0.91]
[null,"DEMANDA DA UNIDADE",null,null,{"$f":"E23*E22","v":4.6137000000000006}]
[null,"POSSUI CARGA TRIFÁSICA",null,null,{"$f":"IF((COUNTIF(B5:B21,\"Motor trifásico\")+COUNTIF(B5:B21,\"Tomada trifásica\"))>0,\"SIM\",\"NÃO\")","v":"SIM"}]
[null,"TIPO DE MEDIÇÃO",null,null,{"$f":"IF(AND(C22<=8000,E25=\"NÃO\"),\"M1\",IF(AND(C22<11000,E25=\"NÃO\"),\"M2\",IF(AND(C22<=15000,E25=\"NÃO\"),\"B1\",IF(AND(C22<=22000,E25=\"NÃO\"),\"B2\",IF(E24<=23,\"T1\",IF(E24<=33,\"T2\",IF(E24<=45,\"T3\",IF(E24<=65,\"T4\",\"DEMANDA NÃO PERMITIDA\"))))))))","v":"T1"}]
[null,"CORRENTE",null,null,{"$f":"IF(OR(E26=\"M1\",E26=\"M2\"),E24/0.22,IF(OR(E26=\"b1\",E26=\"b2\"),E24/0.22/2,IF(OR(E26=\"t1\",E26=\"t2\",E26=\"T3\",E26=\"t4\"),E24/0.38/SQRT(3))))","v":7.0097919393688866}]
[null,"DISJUNTOR",null,null,32]
[null,"CONDUTORES",null,null,{"$f":"IF(E26=\"M1\",Tabelas!D3,IF(E26=\"M2\",Tabelas!D4,IF(E26=\"B1\",Tabelas!D5,IF(E26=\"B2\",Tabelas!D6,IF(E26=\"T1\",Tabelas!D7,IF(E26=\"T2\",Tabelas!D8,IF(E26=\"T3\",Tabelas!D9,IF(E26=\"T4\",Tabelas!D10,\"\"))))))))","v":"3#6(6)T#6"}]
[null,"*Observação: caso o projetista altere a bitola de algum cabo de medição por motivo de queda de tensão, deverá anexar memória de cálculo para cada uma das medições. Indicando o novo cabo adotado. "]
[null,"Unidades Consumidoras Tipo 02"]
[null,"Tipo ","Nº","Pavimento"]
[null,"Loja",1,"1º Pavimento"]
[null,"Loja",2,"2º Pavimento"]

{"sheet":"QD03","index":5,"n_rows":42,"n_cols":12,"rows_kept":42,"cut":false,"hidden":false,"merged":[[61,3,61,4],[50,3,50,4],[51,3,51,4],[52,3,52,4],[53,3,53,4],[54,3,54,4],[55,3,55,4],[56,3,56,4],[57,3,57,4],[58,3,58,4],[59,3,59,4],[60,3,60,4],[49,3,49,4],[38,3,38,4],[39,3,39,4],[40,3,40,4],[41,3,41,4],[42,3,42,4],[43,3,43,4],[44,3,44,4],[45,3,45,4],[46,3,46,4],[47,3,47,4],[48,3,48,4],[37,3,37,4],[26,1,26,3],[27,1,27,3],[28,1,28,3],[29,1,29,4],[30,1,30,4],[31,3,31,4],[32,3,32,4],[33,3,33,4],[34,3,34,4],[35,3,35,4],[36,3,36,4],[3,11,3,17],[4,11,4,17],[25,1,25,3],[1,2,1,4],[2,1,2,4],[22,1,22,3],[23,1,23,3],[24,1,24,3]]}
[]
[null,null,"Painel Coletivo - Interligação Neoenergia Brasília"]
[null,"QD CARGAS TIPO 03"]
[null,"Descrição dos equipamentos","Carga\n(W)","Fator Potência","Carda demandada (kVA)",null,null,null,null,null,null,"          OBSERVAÇÕES"]
[null,"Iluminação",50,1,{"$f":"IFERROR(C5/D5/1000,\"\")","v":0.05}]
[null,"Tomadas",600,1,{"$f":"IFERROR(C6/D6/1000,\"\")","v":0.6}]
[null,"Tomadas",1000,1,1,null,null,null,null,null,null,"PODERÃO SER CADASTRADOS 5 QUADROS DE CARGAS DISTINTOS "]
[null,"Aparelhos de aquecimento",6800,1,6.8,null,null,null,null,null,null,"NO QD01  PODERÃO SER CADASTRASDAS- 20 UNIDADES; NO QD02- 20 UNIDADES"]
[null,null,null,null,"",null,null,null,null,null,null,"NO QD03 - 10 UNIDADES; NO QD04 - 10 UNIDADES ;E NO QD05 - 10 UNIDADES "]
[null,null,null,null,""]
[null,null,null,null,""]
[null,null,null,null,""]
[null,null,null,null,""]
[null,null,null,null,""]
[null,null,null,null,""]
[null,null,null,null,""]
[null,null,null,null,""]
[null,null,null,null,""]
[null,null,null,null,""]
[null,null,null,null,""]
[null,null,null,null,""]
[null,"TOTAL",{"$f":"SUM(C5:C21)","v":8450},null,{"$f":"SUM(E5:E21)","v":8.4499999999999993}]
[null,"FATOR DE DEMANDA ",null,null,0.35]
[null,"DEMANDA DA UNIDADE",null,null,{"$f":"E23*E22","v":2.9574999999999996}]
[null,"POSSUI CARGA TRIFÁSICA",null,null,{"$f":"IF((COUNTIF(B5:B21,\"Motor trifásico\")+COUNTIF(B5:B21,\"Tomada trifásica\"))>0,\"SIM\",\"NÃO\")","v":"NÃO"}]
[null,"TIPO DE MEDIÇÃO",null,null,{"$f":"IF(AND(C22<=8000,E25=\"NÃO\"),\"M1\",IF(AND(C22<11000,E25=\"NÃO\"),\"M2\",IF(AND(C22<=15000,E25=\"NÃO\"),\"B1\",IF(AND(C22<=22000,E25=\"NÃO\"),\"B2\",IF(E24<=23,\"T1\",IF(E24<=33,\"T2\",IF(E24<=45,\"T3\",IF(E24<=65,\"T4\",\"DEMANDA NÃO PERMITIDA\"))))))))","v":"M2"}]
[null,"CORRENTE",null,null,{"$f":"IF(OR(E26=\"M1\",E26=\"M2\"),E24/0.22,IF(OR(E26=\"b1\",E26=\"b2\"),E24/0.22/2,IF(OR(E26=\"t1\",E26=\"t2\",E26=\"T3\",E26=\"t4\"),E24/0.38/SQRT(3))))","v":13.443181818181817}]
[null,"DISJUNTOR",null,null,50]
[null,"CONDUTORES",null,null,{"$f":"IF(E26=\"M1\",Tabelas!D3,IF(E26=\"M2\",Tabelas!D4,IF(E26=\"B1\",Tabelas!D5,IF(E26=\"B2\",Tabelas!D6,IF(E26=\"T1\",Tabelas!D7,IF(E26=\"T2\",Tabelas!D8,IF(E26=\"T3\",Tabelas!D9,IF(E26=\"T4\",Tabelas!D10,\"\"))))))))","v":"1#10(10)T#10"}]
[null,"*Observação: caso o projetista altere a bitola de algum cabo de medição por motivo de queda de tensão, deverá anexar memória de cálculo para cada uma das medições. Indicando o novo cabo adotado. "]
[null,"Unidades Consumidoras Tipo 03"]
[null,"Tipo ","Nº","Pavimento"]
[null,"Apartamento",101,"1º Pavimento"]
[null,"Apartamento",102,"1º Pavimento"]
[null,"Apartamento",103,"1º Pavimento"]
[null,"Apartamento",104,"1º Pavimento"]
[null,"Apartamento",201,"2º Pavimento"]
[null,"Apartamento",202,"2º Pavimento"]
[null,"Apartamento",203,"2º Pavimento"]
[null,"Apartamento",204,"2º Pavimento"]
[null,"Apartamento",301,"3º Pavimento"]
[null,"Apartamento",302,"3º Pavimento"]

{"sheet":"QD04","index":6,"n_rows":32,"n_cols":12,"rows_kept":32,"cut":false,"hidden":false,"merged":[[61,3,61,4],[50,3,50,4],[51,3,51,4],[52,3,52,4],[53,3,53,4],[54,3,54,4],[55,3,55,4],[56,3,56,4],[57,3,57,4],[58,3,58,4],[59,3,59,4],[60,3,60,4],[49,3,49,4],[38,3,38,4],[39,3,39,4],[40,3,40,4],[41,3,41,4],[42,3,42,4],[43,3,43,4],[44,3,44,4],[45,3,45,4],[46,3,46,4],[47,3,47,4],[48,3,48,4],[37,3,37,4],[26,1,26,3],[27,1,27,3],[28,1,28,3],[29,1,29,4],[30,1,30,4],[31,3,31,4],[32,3,32,4],[33,3,33,4],[34,3,34,4],[35,3,35,4],[36,3,36,4],[3,11,3,17],[4,11,4,17],[25,1,25,3],[1,2,1,4],[2,1,2,4],[22,1,22,3],[23,1,23,3],[24,1,24,3]]}
[]
[null,null,"Painel Coletivo - Interligação Neoenergia Brasília"]
[null,"QD CARGAS TIPO 04"]
[null,"Descrição dos equipamentos","Carga\n(W)","Fator Potência","Carda demandada (kVA)",null,null,null,null,null,null,"          OBSERVAÇÕES"]
[null,null,null,null,{"$f":"IFERROR(C5/D5/1000,\"\")","v":""}]
[null,null,null,null,{"$f":"IFERROR(C6/D6/1000,\"\")","v":""}]
[null,null,null,null,"",null,null,null,null,null,null,"PODERÃO SER CADASTRADOS 5 QUADROS DE CARGAS DISTINTOS "]
[null,null,null,null,"",null,null,null,null,null,null,"NO QD01  PODERÃO SER CADASTRASDAS- 20 UNIDADES; NO QD02- 20 UNIDADES"]
[null,null,null,null,null,null,null,null,null,null,null,"NO QD03 - 10 UNIDADES; NO QD04 - 10 UNIDADES ;E NO QD05 - 10 UNIDADES "]
[null,null,null,null,""]
[null,null,null,null,""]
[null,null,null,null,""]
[null,null,null,null,""]
[null,null,null,null,""]
[null,null,null,null,""]
[null,null,null,null,""]
[null,null,null,null,""]
[null,null,null,null,""]
[null,null,null,null,""]
[null,null,null,null,""]
[null,null,null,null,""]
[null,"TOTAL",{"$f":"SUM(C5:C21)","v":0},null,{"$f":"SUM(E5:E21)","v":0}]
[null,"FATOR DE DEMANDA "]
[null,"DEMANDA DA UNIDADE",null,null,{"$f":"E23*E22","v":0}]
[null,"POSSUI CARGA TRIFÁSICA",null,null,{"$f":"IF((COUNTIF(B5:B21,\"Motor trifásico\")+COUNTIF(B5:B21,\"Tomada trifásica\"))>0,\"SIM\",\"NÃO\")","v":"NÃO"}]
[null,"TIPO DE MEDIÇÃO",null,null,{"$f":"IF(AND(C22<=8000,E25=\"NÃO\"),\"M1\",IF(AND(C22<11000,E25=\"NÃO\"),\"M2\",IF(AND(C22<=15000,E25=\"NÃO\"),\"B1\",IF(AND(C22<=22000,E25=\"NÃO\"),\"B2\",IF(E24<=23,\"T1\",IF(E24<=33,\"T2\",IF(E24<=45,\"T3\",IF(E24<=65,\"T4\",\"DEMANDA NÃO PERMITIDA\"))))))))","v":"M1"}]
[null,"CORRENTE",null,null,{"$f":"IF(OR(E26=\"M1\",E26=\"M2\"),E24/0.22,IF(OR(E26=\"b1\",E26=\"b2\"),E24/0.22/2,IF(OR(E26=\"t1\",E26=\"t2\",E26=\"T3\",E26=\"t4\"),E24/0.38/SQRT(3))))","v":0}]
[null,"DISJUNTOR"]
[null,"CONDUTORES",null,null,{"$f":"IF(E26=\"M1\",Tabelas!D3,IF(E26=\"M2\",Tabelas!D4,IF(E26=\"B1\",Tabelas!D5,IF(E26=\"B2\",Tabelas!D6,IF(E26=\"T1\",Tabelas!D7,IF(E26=\"T2\",Tabelas!D8,IF(E26=\"T3\",Tabelas!D9,IF(E26=\"T4\",Tabelas!D10,\"\"))))))))","v":"1#6(6)T#6"}]
[null,"*Observação: caso o projetista altere a bitola de algum cabo de medição por motivo de queda de tensão, deverá anexar memória de cálculo para cada uma das medições. Indicando o novo cabo adotado. "]
[null,"Unidades Consumidoras Tipo 04"]
[null,"Tipo ","Nº","Pavimento"]

{"sheet":"QD05","index":7,"n_rows":32,"n_cols":12,"rows_kept":32,"cut":false,"hidden":false,"merged":[[61,3,61,4],[50,3,50,4],[51,3,51,4],[52,3,52,4],[53,3,53,4],[54,3,54,4],[55,3,55,4],[56,3,56,4],[57,3,57,4],[58,3,58,4],[59,3,59,4],[60,3,60,4],[49,3,49,4],[38,3,38,4],[39,3,39,4],[40,3,40,4],[41,3,41,4],[42,3,42,4],[43,3,43,4],[44,3,44,4],[45,3,45,4],[46,3,46,4],[47,3,47,4],[48,3,48,4],[37,3,37,4],[26,1,26,3],[27,1,27,3],[28,1,28,3],[29,1,29,4],[30,1,30,4],[31,3,31,4],[32,3,32,4],[33,3,33,4],[34,3,34,4],[35,3,35,4],[36,3,36,4],[3,11,3,17],[4,11,4,17],[25,1,25,3],[1,2,1,4],[2,1,2,4],[22,1,22,3],[23,1,23,3],[24,1,24,3]]}
[]
[null,null,"Painel Coletivo - Interligação Neoenergia Brasília"]
[null,"QD CARGAS TIPO 05"]
[null,"Descrição dos equipamentos","Carga\n(W)","Fator Potência","Carda demandada (kVA)",null,null,null,null,null,null,"          OBSERVAÇÕES"]
[null,null,null,null,{"$f":"IFERROR(C5/D5/1000,\"\")","v":""}]
[null,null,null,null,{"$f":"IFERROR(C6/D6/1000,\"\")","v":""}]
[null,null,null,null,"",null,null,null,null,null,null,"PODERÃO SER CADASTRADOS 5 QUADROS DE CARGAS DISTINTOS."]
[null,null,null,null,"",null,null,null,null,null,null,"NO QD01  PODERÃO SER CADASTRASDAS- 20 UNIDADES; NO QD02- 20 UNIDADES"]
[null,null,null,null,"",null,null,null,null,null,null,"NO QD03 - 10 UNIDADES; NO QD04 - 10 UNIDADES ;E NO QD05 - 10 UNIDADES "]
[null,null,null,null,""]
[null,null,null,null,""]
[null,null,null,null,""]
[null,null,null,null,""]
[null,null,null,null,""]
[null,null,null,null,""]
[null,null,null,null,""]
[null,null,null,null,""]
[null,null,null,null,""]
[null,null,null,null,""]
[null,null,null,null,""]
[null,null,null,null,""]
[null,"TOTAL",{"$f":"SUM(C5:C21)","v":0},null,{"$f":"SUM(E5:E21)","v":0}]
[null,"FATOR DE DEMANDA "]
[null,"DEMANDA DA UNIDADE",null,null,{"$f":"E23*E22","v":0}]
[null,"POSSUI CARGA TRIFÁSICA",null,null,{"$f":"IF((COUNTIF(B5:B21,\"Motor trifásico\")+COUNTIF(B5:B21,\"Tomada trifásica\"))>0,\"SIM\",\"NÃO\")","v":"NÃO"}]
[null,"TIPO DE MEDIÇÃO",null,null,{"$f":"IF(AND(C22<=8000,E25=\"NÃO\"),\"M1\",IF(AND(C22<11000,E25=\"NÃO\"),\"M2\",IF(AND(C22<=15000,E25=\"NÃO\"),\"B1\",IF(AND(C22<=22000,E25=\"NÃO\"),\"B2\",IF(E24<=23,\"T1\",IF(E24<=33,\"T2\",IF(E24<=45,\"T3\",IF(E24<=65,\"T4\",\"DEMANDA NÃO PERMITIDA\"))))))))","v":"M1"}]
[null,"CORRENTE",null,null,{"$f":"IF(OR(E26=\"M1\",E26=\"M2\"),E24/0.22,IF(OR(E26=\"b1\",E26=\"b2\"),E24/0.22/2,IF(OR(E26=\"t1\",E26=\"t2\",E26=\"T3\",E26=\"t4\"),E24/0.38/SQRT(3))))","v":0}]
[null,"DISJUNTOR"]
[null,"CONDUTORES",null,null,{"$f":"IF(E26=\"M1\",Tabelas!D3,IF(E26=\"M2\",Tabelas!D4,IF(E26=\"B1\",Tabelas!D5,IF(E26=\"B2\",Tabelas!D6,IF(E26=\"T1\",Tabelas!D7,IF(E26=\"T2\",Tabelas!D8,IF(E26=\"T3\",Tabelas!D9,IF(E26=\"T4\",Tabelas!D10,\"\"))))))))","v":"1#6(6)T#6"}]
[null,"*Observação: caso o projetista altere a bitola de algum cabo de medição por motivo de queda de tensão, deverá anexar memória de cálculo para cada uma das medições. Indicando o novo cabo adotado. "]
[null,"Unidades Consumidoras Tipo 05"]
[null,"Tipo ","Nº","Pavimento"]

{"sheet":"DadosMedições","index":8,"n_rows":75,"n_cols":15,"rows_kept":75,"cut":false,"hidden":true,"merged":[]}
[null,null,null,"Esta tela não deve ser exibida ao projetista"]
[]
[null,"QD",null,"Identificação da unidade","Pavimento","Carga inst. (kW)",null,"Demanda (KVA)","Ponto trifásico ","TIPO","FASES",null,"Disjuntor ","Condutores","Caixa"]
[null,"QDINC",null,"Incêndio",null,{"$f":"QDINC!C23","v":20000},null,{"$f":"QDINC!E25","v":10},{"$f":"QDINC!E26","v":"SIM"},{"$f":"QDINC!E27","v":"T1"},{"$f":"VLOOKUP(J4,Tabelas!$A$2:$G$10,2,FALSE)","v":"TRIF "},null,{"$f":"_xlfn.CONCAT(\"DISJ \",K4,\" \",QDINC!$E$29,\"A\")","v":"DISJ TRIF  32A"},{"$f":"VLOOKUP(J4,CABOS,4,FALSE)","v":"3#6(6)T#6"},"P1"]
["Número","QD",null,"Identificação da unidade","Pavimento","Carga inst. (kW)","Carga Inst kVA","Demanda (KVA)","Ponto trifásico ","TIPO","FASES",null,"Disjuntor ","Condutores","Painel de madeira"]
[{"$f":"IF(D6=\" \",\" \",COUNT($A$5:A5)+1)","v":1},"QD01",1,{"$f":"IF(_xlfn.CONCAT('QD01'!B33,\"\",'QD01'!C33)=\"\",\"\",_xlfn.CONCAT('QD01'!B33,\"\",'QD01'!C33))","v":"Serviço1"},{"$f":"'QD01'!D33","v":"Térreo"},{"$f":"'QD01'!C22","v":1250},{"$f":"'QD01'!E22","v":1.25},{"$f":"'QD01'!E24","v":0.625},{"$f":"'QD01'!$E$25","v":"NÃO"},{"$f":"'QD01'!$E$26","v":"M1"},{"$f":"VLOOKUP(J6,Tabelas!$A$2:$G$10,2,FALSE)","v":"MONOF "},{"$f":"IF(K6=\"MONOF \",1,IF(K6=\"BIF \",2,IF(K6=\"TRIF \",3,\"\")))","v":1},{"$f":"_xlfn.CONCAT(\"DISJ \",K6,\" \",'QD01'!$E$28,\"A\")","v":"DISJ MONOF  32A"},{"$f":"VLOOKUP(J6,CABOS,4,FALSE)","v":"1#6(6)T#6"}]
[{"$f":"IF(D7=\" \",\" \",COUNT($A$5:A6)+1)","v":2},"QD01",2,{"$f":"IF(_xlfn.CONCAT('QD01'!B34,\"\",'QD01'!C34)=\"\",\"\",_xlfn.CONCAT('QD01'!B34,\"\",'QD01'!C34))","v":""},{"$f":"'QD01'!D34","v":0},{"$f":"'QD01'!C22","v":1250},{"$f":"'QD01'!E22","v":1.25},{"$f":"'QD01'!E24","v":0.625},{"$f":"'QD01'!$E$25","v":"NÃO"},{"$f":"'QD01'!$E$26","v":"M1"},{"$f":"VLOOKUP(J7,Tabelas!$A$2:$G$10,2,FALSE)","v":"MONOF "},{"$f":"IF(K7=\"MONOF \",1,IF(K7=\"BIF \",2,IF(K7=\"TRIF \",3,\"\")))","v":1},{"$f":"_xlfn.CONCAT(\"DISJ \",K7,\" \",'QD01'!$E$28,\"A\")","v":"DISJ MONOF  32A"},{"$f":"VLOOKUP(J7,CABOS,4,FALSE)","v":"1#6(6)T#6"}]
[{"$f":"IF(D8=\" \",\" \",COUNT($A$5:A7)+1)","v":3},"QD01",3,{"$f":"IF(_xlfn.CONCAT('QD01'!B35,\"\",'QD01'!C35)=\"\",\"\",_xlfn.CONCAT('QD01'!B35,\"\",'QD01'!C35))","v":""},{"$f":"'QD01'!D35","v":0},{"$f":"'QD01'!C22","v":1250},{"$f":"'QD01'!E22","v":1.25},{"$f":"'QD01'!E24","v":0.625},{"$f":"'QD01'!$E$25","v":"NÃO"},{"$f":"'QD01'!$E$26","v":"M1"},{"$f":"VLOOKUP(J8,Tabelas!$A$2:$G$10,2,FALSE)","v":"MONOF "},1,{"$f":"_xlfn.CONCAT(\"DISJ \",K8,\" \",'QD01'!$E$28,\"A\")","v":"DISJ MONOF  32A"},"1#6(6)T#6"]
[{"$f":"IF(D9=\" \",\" \",COUNT($A$5:A8)+1)","v":4},"QD01",4,{"$f":"IF(_xlfn.CONCAT('QD01'!B36,\"\",'QD01'!C36)=\"\",\"\",_xlfn.CONCAT('QD01'!B36,\"\",'QD01'!C36))","v":""},{"$f":"'QD01'!D36","v":0},{"$f":"'QD01'!C22","v":1250},{"$f":"'QD01'!E22","v":1.25},{"$f":"'QD01'!E24","v":0.625},{"$f":"'QD01'!$E$25","v":"NÃO"},{"$f":"'QD01'!$E$26","v":"M1"},{"$f":"VLOOKUP(J9,Tabelas!$A$2:$G$10,2,FALSE)","v":"MONOF "},1,{"$f":"_xlfn.CONCAT(\"DISJ \",K9,\" \",'QD01'!$E$28,\"A\")","v":"DISJ MONOF  32A"},"1#6(6)T#6"]
[{"$f":"IF(D10=\" \",\" \",COUNT($A$5:A9)+1)","v":5},"QD01",5,{"$f":"IF(_xlfn.CONCAT('QD01'!B37,\"\",'QD01'!C37)=\"\",\"\",_xlfn.CONCAT('QD01'!B37,\"\",'QD01'!C37))","v":""},{"$f":"'QD01'!D37","v":0},{"$f":"'QD01'!C22","v":1250},{"$f":"'QD01'!E22","v":1.25},{"$f":"'QD01'!E24","v":0.625},{"$f":"'QD01'!$E$25","v":"NÃO"},{"$f":"'QD01'!$E$26","v":"M1"},{"$f":"VLOOKUP(J10,Tabelas!$A$2:$G$10,2,FALSE)","v":"MONOF "},1,{"$f":"_xlfn.CONCAT(\"DISJ \",K10,\" \",'QD01'!$E$28,\"A\")","v":"DISJ MONOF  32A"},"1#6(6)T#6"]
[{"$f":"IF(D11=\" \",\" \",COUNT($A$5:A10)+1)","v":6},"QD01",6,{"$f":"IF(_xlfn.CONCAT('QD01'!B38,\"\",'QD01'!C38)=\"\",\"\",_xlfn.CONCAT('QD01'!B38,\"\",'QD01'!C38))","v":""},{"$f":"'QD01'!D38","v":0},{"$f":"'QD01'!C22","v":1250},{"$f":"'QD01'!E22","v":1.25},{"$f":"'QD01'!E24","v":0.625},{"$f":"'QD01'!$E$25","v":"NÃO"},{"$f":"'QD01'!$E$26","v":"M1"},{"$f":"VLOOKUP(J11,Tabelas!$A$2:$G$10,2,FALSE)","v":"MONOF "},1,{"$f":"_xlfn.CONCAT(\"DISJ \",K11,\" \",'QD01'!$E$28,\"A\")","v":"DISJ MONOF  32A"},"1#6(6)T#6"]
[{"$f":"IF(D12=\" \",\" \",COUNT($A$5:A11)+1)","v":7},"QD01",7,{"$f":"IF(_xlfn.CONCAT('QD01'!B39,\"\",'QD01'!C39)=\"\",\"\",_xlfn.CONCAT('QD01'!B39,\"\",'QD01'!C39))","v":""},{"$f":"'QD01'!D39","v":0},{"$f":"'QD01'!C22","v":1250},{"$f":"'QD01'!E22","v":1.25},{"$f":"'QD01'!E24","v":0.625},{"$f":"'QD01'!$E$25","v":"NÃO"},{"$f":"'QD01'!$E$26","v":"M1"},{"$f":"VLOOKUP(J12,Tabelas!$A$2:$G$10,2,FALSE)","v":"MONOF "},1,{"$f":"_xlfn.CONCAT(\"DISJ \",K12,\" \",'QD01'!$E$28,\"A\")","v":"DISJ MONOF  32A"},"1#6(6)T#6"]
[{"$f":"IF(D13=\" \",\" \",COUNT($A$5:A12)+1)","v":8},"QD01",8,{"$f":"IF(_xlfn.CONCAT('QD01'!B40,\"\",'QD01'!C40)=\"\",\"\",_xlfn.CONCAT('QD01'!B40,\"\",'QD01'!C40))","v":""},{"$f":"'QD01'!D40","v":0},{"$f":"'QD01'!C22","v":1250},{"$f":"'QD01'!E22","v":1.25},{"$f":"'QD01'!E24","v":0.625},{"$f":"'QD01'!$E$25","v":"NÃO"},{"$f":"'QD01'!$E$26","v":"M1"},{"$f":"VLOOKUP(J13,Tabelas!$A$2:$G$10,2,FALSE)","v":"MONOF "},1,{"$f":"_xlfn.CONCAT(\"DISJ \",K13,\" \",'QD01'!$E$28,\"A\")","v":"DISJ MONOF  32A"},"1#6(6)T#6"]
[{"$f":"IF(D14=\" \",\" \",COUNT($A$5:A13)+1)","v":9},"QD01",9,{"$f":"IF(_xlfn.CONCAT('QD01'!B41,\"\",'QD01'!C41)=\"\",\"\",_xlfn.CONCAT('QD01'!B41,\"\",'QD01'!C41))","v":""},{"$f":"'QD01'!D41","v":0},{"$f":"'QD01'!C22","v":1250},{"$f":"'QD01'!E22","v":1.25},{"$f":"'QD01'!E24","v":0.625},{"$f":"'QD01'!$E$25","v":"NÃO"},{"$f":"'QD01'!$E$26","v":"M1"},{"$f":"VLOOKUP(J14,Tabelas!$A$2:$G$10,2,FALSE)","v":"MONOF "},1,{"$f":"_xlfn.CONCAT(\"DISJ \",K14,\" \",'QD01'!$E$28,\"A\")","v":"DISJ MONOF  32A"},"1#6(6)T#6"]
[{"$f":"IF(D15=\" \",\" \",COUNT($A$5:A14)+1)","v":10},"QD01",10,{"$f":"IF(_xlfn.CONCAT('QD01'!B42,\"\",'QD01'!C42)=\"\",\"\",_xlfn.CONCAT('QD01'!B42,\"\",'QD01'!C42))","v":""},{"$f":"'QD01'!D42","v":0},{"$f":"'QD01'!C22","v":1250},{"$f":"'QD01'!E22","v":1.25},{"$f":"'QD01'!E24","v":0.625},{"$f":"'QD01'!$E$25","v":"NÃO"},{"$f":"'QD01'!$E$26","v":"M1"},{"$f":"VLOOKUP(J15,Tabelas!$A$2:$G$10,2,FALSE)","v":"MONOF "},1,{"$f":"_xlfn.CONCAT(\"DISJ \",K15,\" \",'QD01'!$E$28,\"A\")","v":"DISJ MONOF  32A"},"1#6(6)T#6"]
[{"$f":"IF(D16=\" \",\" \",COUNT($A$5:A15)+1)","v":11},"QD01",11,{"$f":"IF(_xlfn.CONCAT('QD01'!B43,\"\",'QD01'!C43)=\"\",\"\",_xlfn.CONCAT('QD01'!B43,\"\",'QD01'!C43))","v":""},{"$f":"'QD01'!D43","v":0},{"$f":"'QD01'!C22","v":1250},{"$f":"'QD01'!E22","v":1.25},{"$f":"'QD01'!E24","v":0.625},{"$f":"'QD01'!$E$25","v":"NÃO"},{"$f":"'QD01'!$E$26","v":"M1"},{"$f":"VLOOKUP(J16,Tabelas!$A$2:$G$10,2,FALSE)","v":"MONOF "},1,{"$f":"_xlfn.CONCAT(\"DISJ \",K16,\" \",'QD01'!$E$28,\"A\")","v":"DISJ MONOF  32A"},"1#6(6)T#6"]
[{"$f":"IF(D17=\" \",\" \",COUNT($A$5:A16)+1)","v":12},"QD01",12,{"$f":"IF(_xlfn.CONCAT('QD01'!B44,\"\",'QD01'!C44)=\"\",\"\",_xlfn.CONCAT('QD01'!B44,\"\",'QD01'!C44))","v":""},{"$f":"'QD01'!D44","v":0},{"$f":"'QD01'!C22","v":1250},{"$f":"'QD01'!E22","v":1.25},{"$f":"'QD01'!E24","v":0.625},{"$f":"'QD01'!$E$25","v":"NÃO"},{"$f":"'QD01'!$E$26","v":"M1"},{"$f":"VLOOKUP(J17,Tabelas!$A$2:$G$10,2,FALSE)","v":"MONOF "},1,{"$f":"_xlfn.CONCAT(\"DISJ \",K17,\" \",'QD01'!$E$28,\"A\")","v":"DISJ MONOF  32A"},"1#6(6)T#6"]
[{"$f":"IF(D18=\" \",\" \",COUNT($A$5:A17)+1)","v":13},"QD01",13,{"$f":"IF(_xlfn.CONCAT('QD01'!B45,\"\",'QD01'!C45)=\"\",\"\",_xlfn.CONCAT('QD01'!B45,\"\",'QD01'!C45))","v":""},{"$f":"'QD01'!D45","v":0},{"$f":"'QD01'!C22","v":1250},{"$f":"'QD01'!E22","v":1.25},{"$f":"'QD01'!E24","v":0.625},{"$f":"'QD01'!$E$25","v":"NÃO"},{"$f":"'QD01'!$E$26","v":"M1"},{"$f":"VLOOKUP(J18,Tabelas!$A$2:$G$10,2,FALSE)","v":"MONOF "},1,{"$f":"_xlfn.CONCAT(\"DISJ \",K18,\" \",'QD01'!$E$28,\"A\")","v":"DISJ MONOF  32A"},"1#6(6)T#6"]
[{"$f":"IF(D19=\" \",\" \",COUNT($A$5:A18)+1)","v":14},"QD01",14,{"$f":"IF(_xlfn.CONCAT('QD01'!B46,\"\",'QD01'!C46)=\"\",\"\",_xlfn.CONCAT('QD01'!B46,\"\",'QD01'!C46))","v":""},{"$f":"'QD01'!D46","v":0},{"$f":"'QD01'!C22","v":1250},{"$f":"'QD01'!E22","v":1.25},{"$f":"'QD01'!E24","v":0.625},{"$f":"'QD01'!$E$25","v":"NÃO"},{"$f":"'QD01'!$E$26","v":"M1"},{"$f":"VLOOKUP(J19,Tabelas!$A$2:$G$10,2,FALSE)","v":"MONOF "},1,{"$f":"_xlfn.CONCAT(\"DISJ \",K19,\" \",'QD01'!$E$28,\"A\")","v":"DISJ MONOF  32A"},"1#6(6)T#6"]
[{"$f":"IF(D20=\" \",\" \",COUNT($A$5:A19)+1)","v":15},"QD01",15,{"$f":"IF(_xlfn.CONCAT('QD01'!B47,\"\",'QD01'!C47)=\"\",\"\",_xlfn.CONCAT('QD01'!B47,\"\",'QD01'!C47))","v":""},{"$f":"'QD01'!D47","v":0},{"$f":"'QD01'!C22","v":1250},{"$f":"'QD01'!E22","v":1.25},{"$f":"'QD01'!E24","v":0.625},{"$f":"'QD01'!$E$25","v":"NÃO"},{"$f":"'QD01'!$E$26","v":"M1"},{"$f":"VLOOKUP(J20,Tabelas!$A$2:$G$10,2,FALSE)","v":"MONOF "},1,{"$f":"_xlfn.CONCAT(\"DISJ \",K20,\" \",'QD01'!$E$28,\"A\")","v":"DISJ MONOF  32A"},"1#6(6)T#6"]
[{"$f":"IF(D21=\" \",\" \",COUNT($A$5:A20)+1)","v":16},"QD01",16,{"$f":"IF(_xlfn.CONCAT('QD01'!B48,\"\",'QD01'!C48)=\"\",\"\",_xlfn.CONCAT('QD01'!B48,\"\",'QD01'!C48))","v":""},{"$f":"'QD01'!D48","v":0},{"$f":"'QD01'!C22","v":1250},{"$f":"'QD01'!E22","v":1.25},{"$f":"'QD01'!E24","v":0.625},{"$f":"'QD01'!$E$25","v":"NÃO"},{"$f":"'QD01'!$E$26","v":"M1"},{"$f":"VLOOKUP(J21,Tabelas!$A$2:$G$10,2,FALSE)","v":"MONOF "},1,{"$f":"_xlfn.CONCAT(\"DISJ \",K21,\" \",'QD01'!$E$28,\"A\")","v":"DISJ MONOF  32A"},"1#6(6)T#6"]
[{"$f":"IF(D22=\" \",\" \",COUNT($A$5:A21)+1)","v":17},"QD01",17,{"$f":"IF(_xlfn.CONCAT('QD01'!B49,\"\",'QD01'!C49)=\"\",\"\",_xlfn.CONCAT('QD01'!B49,\"\",'QD01'!C49))","v":""},{"$f":"'QD01'!D49","v":0},{"$f":"'QD01'!C22","v":1250},{"$f":"'QD01'!E22","v":1.25},{"$f":"'QD01'!E24","v":0.625},{"$f":"'QD01'!$E$25","v":"NÃO"},{"$f":"'QD01'!$E$26","v":"M1"},{"$f":"VLOOKUP(J22,Tabelas!$A$2:$G$10,2,FALSE)","v":"MONOF "},1,{"$f":"_xlfn.CONCAT(\"DISJ \",K22,\" \",'QD01'!$E$28,\"A\")","v":"DISJ MONOF  32A"},"1#6(6)T#6"]
[{"$f":"IF(D23=\" \",\" \",COUNT($A$5:A22)+1)","v":18},"QD01",18,{"$f":"IF(_xlfn.CONCAT('QD01'!B50,\"\",'QD01'!C50)=\"\",\"\",_xlfn.CONCAT('QD01'!B50,\"\",'QD01'!C50))","v":""},{"$f":"'QD01'!D50","v":0},{"$f":"'QD01'!C22","v":1250},{"$f":"'QD01'!E22","v":1.25},{"$f":"'QD01'!E24","v":0.625},{"$f":"'QD01'!$E$25","v":"NÃO"},{"$f":"'QD01'!$E$26","v":"M1"},{"$f":"VLOOKUP(J23,Tabelas!$A$2:$G$10,2,FALSE)","v":"MONOF "},1,{"$f":"_xlfn.CONCAT(\"DISJ \",K23,\" \",'QD01'!$E$28,\"A\")","v":"DISJ MONOF  32A"},"1#6(6)T#6"]
[{"$f":"IF(D24=\" \",\" \",COUNT($A$5:A23)+1)","v":19},"QD01",19,{"$f":"IF(_xlfn.CONCAT('QD01'!B51,\"\",'QD01'!C51)=\"\",\"\",_xlfn.CONCAT('QD01'!B51,\"\",'QD01'!C51))","v":""},{"$f":"'QD01'!D51","v":0},{"$f":"'QD01'!C22","v":1250},{"$f":"'QD01'!E22","v":1.25},{"$f":"'QD01'!E24","v":0.625},{"$f":"'QD01'!$E$25","v":"NÃO"},{"$f":"'QD01'!$E$26","v":"M1"},{"$f":"VLOOKUP(J24,Tabelas!$A$2:$G$10,2,FALSE)","v":"MONOF "},1,{"$f":"_xlfn.CONCAT(\"DISJ \",K24,\" \",'QD01'!$E$28,\"A\")","v":"DISJ MONOF  32A"},"1#6(6)T#6"]
[{"$f":"IF(D25=\" \",\" \",COUNT($A$5:A24)+1)","v":20},"QD01",20,{"$f":"IF(_xlfn.CONCAT('QD01'!B52,\"\",'QD01'!C52)=\"\",\"\",_xlfn.CONCAT('QD01'!B52,\"\",'QD01'!C52))","v":""},{"$f":"'QD01'!D52","v":0},{"$f":"'QD01'!C22","v":1250},{"$f":"'QD01'!E22","v":1.25},{"$f":"'QD01'!E24","v":0.625},{"$f":"'QD01'!$E$25","v":"NÃO"},{"$f":"'QD01'!$E$26","v":"M1"},{"$f":"VLOOKUP(J25,Tabelas!$A$2:$G$10,2,FALSE)","v":"MONOF "},1,{"$f":"_xlfn.CONCAT(\"DISJ \",K25,\" \",'QD01'!$E$28,\"A\")","v":"DISJ MONOF  32A"},"1#6(6)T#6"]
[{"$f":"IF(D26=\" \",\" \",COUNT($A$26:A45)+1)","v":" "},"QD02",1,{"$f":"IF(_xlfn.CONCAT('QD02'!B33,\"\",'QD02'!C33)=\"\",\"\",_xlfn.CONCAT('QD02'!B33,\"\",'QD02'!C33))","v":"Loja1"},{"$f":"'QD02'!D33","v":"1º Pavimento"},{"$f":"'QD02'!C22","v":5070},{"$f":"'QD02'!E22","v":5.07},{"$f":"'QD02'!E24","v":4.6137000000000006},{"$f":"'QD02'!$E$25","v":"SIM"},{"$f":"'QD02'!$E$26","v":"T1"},{"$f":"VLOOKUP(J26,Tabelas!$A$2:$G$10,2,FALSE)","v":"TRIF "},3,{"$f":"_xlfn.CONCAT(\"DISJ \",K26,\" \",'QD02'!$E$28,\"A\")","v":"DISJ TRIF  32A"},{"$f":"VLOOKUP(J26,CABOS,4,FALSE)","v":"3#6(6)T#6"}]
[{"$f":"IF(D27=\" \",\" \",COUNT($A$26:A46)+1)","v":" "},"QD02",2,{"$f":"IF(_xlfn.CONCAT('QD02'!B34,\"\",'QD02'!C34)=\"\",\"\",_xlfn.CONCAT('QD02'!B34,\"\",'QD02'!C34))","v":"Loja2"},{"$f":"'QD02'!D34","v":"2º Pavimento"},{"$f":"'QD02'!C22","v":5070},{"$f":"'QD02'!E22","v":5.07},{"$f":"'QD02'!E24","v":4.6137000000000006},{"$f":"'QD02'!$E$25","v":"SIM"},{"$f":"'QD02'!$E$26","v":"T1"},{"$f":"VLOOKUP(J27,Tabelas!$A$2:$G$10,2,FALSE)","v":"TRIF "},3,{"$f":"_xlfn.CONCAT(\"DISJ \",K27,\" \",'QD02'!$E$28,\"A\")","v":"DISJ TRIF  32A"},"3#6(6)T#6"]
[{"$f":"IF(D28=\" \",\" \",COUNT($A$26:A47)+1)","v":" "},"QD02",3,{"$f":"IF(_xlfn.CONCAT('QD02'!B35,\"\",'QD02'!C35)=\"\",\"\",_xlfn.CONCAT('QD02'!B35,\"\",'QD02'!C35))","v":""},{"$f":"'QD02'!D35","v":0},{"$f":"'QD02'!C22","v":5070},{"$f":"'QD01'!E22","v":1.25},{"$f":"'QD02'!E24","v":4.6137000000000006},{"$f":"'QD02'!$E$25","v":"SIM"},{"$f":"'QD02'!$E$26","v":"T1"},{"$f":"VLOOKUP(J28,Tabelas!$A$2:$G$10,2,FALSE)","v":"TRIF "},3,{"$f":"_xlfn.CONCAT(\"DISJ \",K28,\" \",'QD02'!$E$28,\"A\")","v":"DISJ TRIF  32A"},"3#6(6)T#6"]
[{"$f":"IF(D29=\" \",\" \",COUNT($A$26:A48)+1)","v":" "},"QD02",4,{"$f":"IF(_xlfn.CONCAT('QD02'!B36,\"\",'QD02'!C36)=\"\",\"\",_xlfn.CONCAT('QD02'!B36,\"\",'QD02'!C36))","v":""},{"$f":"'QD02'!D36","v":0},{"$f":"'QD02'!C22","v":5070},{"$f":"'QD01'!E22","v":1.25},{"$f":"'QD02'!E24","v":4.6137000000000006},{"$f":"'QD02'!$E$25","v":"SIM"},{"$f":"'QD02'!$E$26","v":"T1"},{"$f":"VLOOKUP(J29,Tabelas!$A$2:$G$10,2,FALSE)","v":"TRIF "},3,{"$f":"_xlfn.CONCAT(\"DISJ \",K29,\" \",'QD02'!$E$28,\"A\")","v":"DISJ TRIF  32A"},"3#6(6)T#6"]
[{"$f":"IF(D30=\" \",\" \",COUNT($A$26:A49)+1)","v":" "},"QD02",5,{"$f":"IF(_xlfn.CONCAT('QD02'!B37,\"\",'QD02'!C37)=\"\",\"\",_xlfn.CONCAT('QD02'!B37,\"\",'QD02'!C37))","v":""},{"$f":"'QD02'!D37","v":0},{"$f":"'QD02'!C22","v":5070},{"$f":"'QD01'!E22","v":1.25},{"$f":"'QD02'!E24","v":4.6137000000000006},{"$f":"'QD02'!$E$25","v":"SIM"},{"$f":"'QD02'!$E$26","v":"T1"},{"$f":"VLOOKUP(J30,Tabelas!$A$2:$G$10,2,FALSE)","v":"TRIF "},3,{"$f":"_xlfn.CONCAT(\"DISJ \",K30,\" \",'QD02'!$E$28,\"A\")","v":"DISJ TRIF  32A"},"3#6(6)T#6"]
[{"$f":"IF(D31=\" \",\" \",COUNT($A$26:A50)+1)","v":" "},"QD02",6,{"$f":"IF(_xlfn.CONCAT('QD02'!B38,\"\",'QD02'!C38)=\"\",\"\",_xlfn.CONCAT('QD02'!B38,\"\",'QD02'!C38))","v":""},{"$f":"'QD02'!D38","v":0},{"$f":"'QD02'!C22","v":5070},{"$f":"'QD01'!E22","v":1.25},{"$f":"'QD02'!E24","v":4.6137000000000006},{"$f":"'QD02'!$E$25","v":"SIM"},{"$f":"'QD02'!$E$26","v":"T1"},{"$f":"VLOOKUP(J31,Tabelas!$A$2:$G$10,2,FALSE)","v":"TRIF "},3,{"$f":"_xlfn.CONCAT(\"DISJ \",K31,\" \",'QD02'!$E$28,\"A\")","v":"DISJ TRIF  32A"},"3#6(6)T#6"]
[{"$f":"IF(D32=\" \",\" \",COUNT($A$26:A51)+1)","v":" "},"QD02",7,{"$f":"IF(_xlfn.CONCAT('QD02'!B39,\"\",'QD02'!C39)=\"\",\"\",_xlfn.CONCAT('QD02'!B39,\"\",'QD02'!C39))","v":""},{"$f":"'QD02'!D39","v":0},{"$f":"'QD02'!C22","v":5070},{"$f":"'QD01'!E22","v":1.25},{"$f":"'QD02'!E24","v":4.6137000000000006},{"$f":"'QD02'!$E$25","v":"SIM"},{"$f":"'QD02'!$E$26","v":"T1"},{"$f":"VLOOKUP(J32,Tabelas!$A$2:$G$10,2,FALSE)","v":"TRIF "},3,{"$f":"_xlfn.CONCAT(\"DISJ \",K32,\" \",'QD02'!$E$28,\"A\")","v":"DISJ TRIF  32A"},"3#6(6)T#6"]
[{"$f":"IF(D33=\" \",\" \",COUNT($A$26:A52)+1)","v":" "},"QD02",8,{"$f":"IF(_xlfn.CONCAT('QD02'!B40,\"\",'QD02'!C40)=\"\",\"\",_xlfn.CONCAT('QD02'!B40,\"\",'QD02'!C40))","v":""},{"$f":"'QD02'!D40","v":0},{"$f":"'QD02'!C22","v":5070},{"$f":"'QD01'!E22","v":1.25},{"$f":"'QD02'!E24","v":4.6137000000000006},{"$f":"'QD02'!$E$25","v":"SIM"},{"$f":"'QD02'!$E$26","v":"T1"},{"$f":"VLOOKUP(J33,Tabelas!$A$2:$G$10,2,FALSE)","v":"TRIF "},3,{"$f":"_xlfn.CONCAT(\"DISJ \",K33,\" \",'QD02'!$E$28,\"A\")","v":"DISJ TRIF  32A"},"3#6(6)T#6"]
[{"$f":"IF(D34=\" \",\" \",COUNT($A$26:A53)+1)","v":" "},"QD02",9,{"$f":"IF(_xlfn.CONCAT('QD02'!B41,\"\",'QD02'!C41)=\"\",\"\",_xlfn.CONCAT('QD02'!B41,\"\",'QD02'!C41))","v":""},{"$f":"'QD02'!D41","v":0},{"$f":"'QD02'!C22","v":5070},{"$f":"'QD01'!E22","v":1.25},{"$f":"'QD02'!E24","v":4.6137000000000006},{"$f":"'QD02'!$E$25","v":"SIM"},{"$f":"'QD02'!$E$26","v":"T1"},{"$f":"VLOOKUP(J34,Tabelas!$A$2:$G$10,2,FALSE)","v":"TRIF "},3,{"$f":"_xlfn.CONCAT(\"DISJ \",K34,\" \",'QD02'!$E$28,\"A\")","v":"DISJ TRIF  32A"},"3#6(6)T#6"]
[{"$f":"IF(D35=\" \",\" \",COUNT($A$26:A54)+1)","v":" "},"QD02",10,{"$f":"IF(_xlfn.CONCAT('QD02'!B42,\"\",'QD02'!C42)=\"\",\"\",_xlfn.CONCAT('QD02'!B42,\"\",'QD02'!C42))","v":""},{"$f":"'QD02'!D42","v":0},{"$f":"'QD02'!C22","v":5070},{"$f":"'QD01'!E22","v":1.25},{"$f":"'QD02'!E24","v":4.6137000000000006},{"$f":"'QD02'!$E$25","v":"SIM"},{"$f":"'QD02'!$E$26","v":"T1"},{"$f":"VLOOKUP(J35,Tabelas!$A$2:$G$10,2,FALSE)","v":"TRIF "},3,{"$f":"_xlfn.CONCAT(\"DISJ \",K35,\" \",'QD02'!$E$28,\"A\")","v":"DISJ TRIF  32A"},"3#6(6)T#6"]
[{"$f":"IF(D36=\" \",\" \",COUNT($A$26:A55)+1)","v":" "},"QD02",11,{"$f":"IF(_xlfn.CONCAT('QD02'!B43,\"\",'QD02'!C43)=\"\",\"\",_xlfn.CONCAT('QD02'!B43,\"\",'QD02'!C43))","v":""},{"$f":"'QD02'!D43","v":0},{"$f":"'QD02'!C22","v":5070},{"$f":"'QD01'!E22","v":1.25},{"$f":"'QD02'!E24","v":4.6137000000000006},{"$f":"'QD02'!$E$25","v":"SIM"},{"$f":"'QD02'!$E$26","v":"T1"},{"$f":"VLOOKUP(J36,Tabelas!$A$2:$G$10,2,FALSE)","v":"TRIF "},3,{"$f":"_xlfn.CONCAT(\"DISJ \",K36,\" \",'QD02'!$E$28,\"A\")","v":"DISJ TRIF  32A"},"3#6(6)T#6"]
[{"$f":"IF(D37=\" \",\" \",COUNT($A$26:A56)+1)","v":" "},"QD02",12,{"$f":"IF(_xlfn.CONCAT('QD02'!B44,\"\",'QD02'!C44)=\"\",\"\",_xlfn.CONCAT('QD02'!B44,\"\",'QD02'!C44))","v":""},{"$f":"'QD02'!D44","v":0},{"$f":"'QD02'!C22","v":5070},{"$f":"'QD01'!E22","v":1.25},{"$f":"'QD02'!E24","v":4.6137000000000006},{"$f":"'QD02'!$E$25","v":"SIM"},{"$f":"'QD02'!$E$26","v":"T1"},{"$f":"VLOOKUP(J37,Tabelas!$A$2:$G$10,2,FALSE)","v":"TRIF "},3,{"$f":"_xlfn.CONCAT(\"DISJ \",K37,\" \",'QD02'!$E$28,\"A\")","v":"DISJ TRIF  32A"},"3#6(6)T#6"]
[{"$f":"IF(D38=\" \",\" \",COUNT($A$26:A57)+1)","v":" "},"QD02",13,{"$f":"IF(_xlfn.CONCAT('QD02'!B45,\"\",'QD02'!C45)=\"\",\"\",_xlfn.CONCAT('QD02'!B45,\"\",'QD02'!C45))","v":""},{"$f":"'QD02'!D45","v":0},{"$f":"'QD02'!C22","v":5070},{"$f":"'QD01'!E22","v":1.25},{"$f":"'QD02'!E24","v":4.6137000000000006},{"$f":"'QD02'!$E$25","v":"SIM"},{"$f":"'QD02'!$E$26","v":"T1"},{"$f":"VLOOKUP(J38,Tabelas!$A$2:$G$10,2,FALSE)","v":"TRIF "},3,{"$f":"_xlfn.CONCAT(\"DISJ \",K38,\" \",'QD02'!$E$28,\"A\")","v":"DISJ TRIF  32A"},"3#6(6)T#6"]
[{"$f":"IF(D39=\" \",\" \",COUNT($A$26:A58)+1)","v":" "},"QD02",14,{"$f":"IF(_xlfn.CONCAT('QD02'!B46,\"\",'QD02'!C46)=\"\",\"\",_xlfn.CONCAT('QD02'!B46,\"\",'QD02'!C46))","v":""},{"$f":"'QD02'!D46","v":0},{"$f":"'QD02'!C22","v":5070},{"$f":"'QD01'!E22","v":1.25},{"$f":"'QD02'!E24","v":4.6137000000000006},{"$f":"'QD02'!$E$25","v":"SIM"},{"$f":"'QD02'!$E$26","v":"T1"},{"$f":"VLOOKUP(J39,Tabelas!$A$2:$G$10,2,FALSE)","v":"TRIF "},3,{"$f":"_xlfn.CONCAT(\"DISJ \",K39,\" \",'QD02'!$E$28,\"A\")","v":"DISJ TRIF  32A"},"3#6(6)T#6"]
[{"$f":"IF(D40=\" \",\" \",COUNT($A$26:A59)+1)","v":" "},"QD02",15,{"$f":"IF(_xlfn.CONCAT('QD02'!B47,\"\",'QD02'!C47)=\"\",\"\",_xlfn.CONCAT('QD02'!B47,\"\",'QD02'!C47))","v":""},{"$f":"'QD02'!D47","v":0},{"$f":"'QD02'!C22","v":5070},{"$f":"'QD01'!E22","v":1.25},{"$f":"'QD02'!E24","v":4.6137000000000006},{"$f":"'QD02'!$E$25","v":"SIM"},{"$f":"'QD02'!$E$26","v":"T1"},{"$f":"VLOOKUP(J40,Tabelas!$A$2:$G$10,2,FALSE)","v":"TRIF "},3,{"$f":"_xlfn.CONCAT(\"DISJ \",K40,\" \",'QD02'!$E$28,\"A\")","v":"DISJ TRIF  32A"},"3#6(6)T#6"]
[{"$f":"IF(D41=\" \",\" \",COUNT($A$26:A60)+1)","v":" "},"QD02",16,{"$f":"IF(_xlfn.CONCAT('QD02'!B48,\"\",'QD02'!C48)=\"\",\"\",_xlfn.CONCAT('QD02'!B48,\"\",'QD02'!C48))","v":""},{"$f":"'QD02'!D48","v":0},{"$f":"'QD02'!C22","v":5070},{"$f":"'QD01'!E22","v":1.25},{"$f":"'QD02'!E24","v":4.6137000000000006},{"$f":"'QD02'!$E$25","v":"SIM"},{"$f":"'QD02'!$E$26","v":"T1"},{"$f":"VLOOKUP(J41,Tabelas!$A$2:$G$10,2,FALSE)","v":"TRIF "},3,{"$f":"_xlfn.CONCAT(\"DISJ \",K41,\" \",'QD02'!$E$28,\"A\")","v":"DISJ TRIF  32A"},"3#6(6)T#6"]
[{"$f":"IF(D42=\" \",\" \",COUNT($A$26:A61)+1)","v":" "},"QD02",17,{"$f":"IF(_xlfn.CONCAT('QD02'!B49,\"\",'QD02'!C49)=\"\",\"\",_xlfn.CONCAT('QD02'!B49,\"\",'QD02'!C49))","v":""},{"$f":"'QD02'!D49","v":0},{"$f":"'QD02'!C22","v":5070},{"$f":"'QD01'!E22","v":1.25},{"$f":"'QD02'!E24","v":4.6137000000000006},{"$f":"'QD02'!$E$25","v":"SIM"},{"$f":"'QD02'!$E$26","v":"T1"},{"$f":"VLOOKUP(J42,Tabelas!$A$2:$G$10,2,FALSE)","v":"TRIF "},3,{"$f":"_xlfn.CONCAT(\"DISJ \",K42,\" \",'QD02'!$E$28,\"A\")","v":"DISJ TRIF  32A"},{"$f":"VLOOKUP(J42,CABOS,4,FALSE)","v":"3#6(6)T#6"}]
[{"$f":"IF(D43=\" \",\" \",COUNT($A$26:A62)+1)","v":" "},"QD02",18,{"$f":"IF(_xlfn.CONCAT('QD02'!B50,\"\",'QD02'!C50)=\"\",\"\",_xlfn.CONCAT('QD02'!B50,\"\",'QD02'!C50))","v":""},{"$f":"'QD02'!D50","v":0},{"$f":"'QD02'!C22","v":5070},{"$f":"'QD01'!E22","v":1.25},{"$f":"'QD02'!E24","v":4.6137000000000006},{"$f":"'QD02'!$E$25","v":"SIM"},{"$f":"'QD02'!$E$26","v":"T1"},{"$f":"VLOOKUP(J43,Tabelas!$A$2:$G$10,2,FALSE)","v":"TRIF "},3,{"$f":"_xlfn.CONCAT(\"DISJ \",K43,\" \",'QD02'!$E$28,\"A\")","v":"DISJ TRIF  32A"},"3#6(6)T#6"]
[{"$f":"IF(D44=\" \",\" \",COUNT($A$26:A63)+1)","v":" "},"QD02",19,{"$f":"IF(_xlfn.CONCAT('QD02'!B51,\"\",'QD02'!C51)=\"\",\"\",_xlfn.CONCAT('QD02'!B51,\"\",'QD02'!C51))","v":""},{"$f":"'QD02'!D51","v":0},{"$f":"'QD02'!C22","v":5070},{"$f":"'QD01'!E22","v":1.25},{"$f":"'QD02'!E24","v":4.6137000000000006},{"$f":"'QD02'!$E$25","v":"SIM"},{"$f":"'QD02'!$E$26","v":"T1"},{"$f":"VLOOKUP(J44,Tabelas!$A$2:$G$10,2,FALSE)","v":"TRIF "},3,{"$f":"_xlfn.CONCAT(\"DISJ \",K44,\" \",'QD02'!$E$28,\"A\")","v":"DISJ TRIF  32A"},"3#6(6)T#6"]
[{"$f":"IF(D45=\" \",\" \",COUNT($A$26:A64)+1)","v":" "},"QD02",20,{"$f":"IF(_xlfn.CONCAT('QD02'!B52,\"\",'QD02'!C52)=\"\",\"\",_xlfn.CONCAT('QD02'!B52,\"\",'QD02'!C52))","v":""},{"$f":"'QD02'!D52","v":0},{"$f":"'QD02'!C22","v":5070},{"$f":"'QD01'!E22","v":1.25},{"$f":"'QD02'!E24","v":4.6137000000000006},{"$f":"'QD02'!$E$25","v":"SIM"},{"$f":"'QD02'!$E$26","v":"T1"},{"$f":"VLOOKUP(J45,Tabelas!$A$2:$G$10,2,FALSE)","v":"TRIF "},3,{"$f":"_xlfn.CONCAT(\"DISJ \",K45,\" \",'QD02'!$E$28,\"A\")","v":"DISJ TRIF  32A"},"3#6(6)T#6"]
[{"$f":"IF(D46=\" \",\" \",COUNT($A$46:A55)+1)","v":" "},"QD03",1,{"$f":"IF(_xlfn.CONCAT('QD03'!B33,\"\",'QD03'!C33)=\"\",\"\",_xlfn.CONCAT('QD03'!B33,\"\",'QD03'!C33))","v":"Apartamento101"},{"$f":"'QD03'!D33","v":"1º Pavimento"},{"$f":"'QD03'!C22","v":8450},{"$f":"'QD03'!E22","v":8.4499999999999993},{"$f":"'QD03'!E24","v":2.9574999999999996},{"$f":"'QD03'!$E$25","v":"NÃO"},{"$f":"'QD03'!$E$26","v":"M2"},{"$f":"VLOOKUP(J46,Tabelas!$A$2:$G$10,2,FALSE)","v":"MONOF "},1,{"$f":"_xlfn.CONCAT(\"DISJ \",K46,\" \",'QD03'!$E$28,\"A\")","v":"DISJ MONOF  50A"},"1#10(10)T#10"]
[{"$f":"IF(D47=\" \",\" \",COUNT($A$46:A56)+1)","v":" "},"QD03",2,{"$f":"IF(_xlfn.CONCAT('QD03'!B34,\"\",'QD03'!C34)=\"\",\"\",_xlfn.CONCAT('QD03'!B34,\"\",'QD03'!C34))","v":"Apartamento102"},{"$f":"'QD03'!D34","v":"1º Pavimento"},{"$f":"'QD03'!C22","v":8450},{"$f":"'QD03'!E22","v":8.4499999999999993},{"$f":"'QD03'!E24","v":2.9574999999999996},{"$f":"'QD03'!$E$25","v":"NÃO"},{"$f":"'QD03'!$E$26","v":"M2"},{"$f":"VLOOKUP(J47,Tabelas!$A$2:$G$10,2,FALSE)","v":"MONOF "},1,{"$f":"_xlfn.CONCAT(\"DISJ \",K47,\" \",'QD03'!$E$28,\"A\")","v":"DISJ MONOF  50A"},"1#10(10)T#10"]
[{"$f":"IF(D48=\" \",\" \",COUNT($A$46:A57)+1)","v":" "},"QD03",3,{"$f":"IF(_xlfn.CONCAT('QD03'!B35,\"\",'QD03'!C35)=\"\",\"\",_xlfn.CONCAT('QD03'!B35,\"\",'QD03'!C35))","v":"Apartamento103"},{"$f":"'QD03'!D35","v":"1º Pavimento"},{"$f":"'QD03'!C22","v":8450},{"$f":"'QD03'!E22","v":8.4499999999999993},{"$f":"'QD03'!E24","v":2.9574999999999996},{"$f":"'QD03'!$E$25","v":"NÃO"},{"$f":"'QD03'!$E$26","v":"M2"},{"$f":"VLOOKUP(J48,Tabelas!$A$2:$G$10,2,FALSE)","v":"MONOF "},1,{"$f":"_xlfn.CONCAT(\"DISJ \",K48,\" \",'QD03'!$E$28,\"A\")","v":"DISJ MONOF  50A"},"1#10(10)T#10"]
[{"$f":"IF(D49=\" \",\" \",COUNT($A$46:A58)+1)","v":" "},"QD03",4,{"$f":"IF(_xlfn.CONCAT('QD03'!B36,\"\",'QD03'!C36)=\"\",\"\",_xlfn.CONCAT('QD03'!B36,\"\",'QD03'!C36))","v":"Apartamento104"},{"$f":"'QD03'!D36","v":"1º Pavimento"},{"$f":"'QD03'!C22","v":8450},{"$f":"'QD03'!E22","v":8.4499999999999993},{"$f":"'QD03'!E24","v":2.9574999999999996},{"$f":"'QD03'!$E$25","v":"NÃO"},{"$f":"'QD03'!$E$26","v":"M2"},{"$f":"VLOOKUP(J49,Tabelas!$A$2:$G$10,2,FALSE)","v":"MONOF "},1,{"$f":"_xlfn.CONCAT(\"DISJ \",K49,\" \",'QD03'!$E$28,\"A\")","v":"DISJ MONOF  50A"},"1#10(10)T#10"]
[{"$f":"IF(D50=\" \",\" \",COUNT($A$46:A59)+1)","v":" "},"QD03",5,{"$f":"IF(_xlfn.CONCAT('QD03'!B37,\"\",'QD03'!C37)=\"\",\"\",_xlfn.CONCAT('QD03'!B37,\"\",'QD03'!C37))","v":"Apartamento201"},{"$f":"'QD03'!D37","v":"2º Pavimento"},{"$f":"'QD03'!C22","v":8450},{"$f":"'QD03'!E22","v":8.4499999999999993},{"$f":"'QD03'!E24","v":2.9574999999999996},{"$f":"'QD03'!$E$25","v":"NÃO"},{"$f":"'QD03'!$E$26","v":"M2"},{"$f":"VLOOKUP(J50,Tabelas!$A$2:$G$10,2,FALSE)","v":"MONOF "},1,{"$f":"_xlfn.CONCAT(\"DISJ \",K50,\" \",'QD03'!$E$28,\"A\")","v":"DISJ MONOF  50A"},"1#10(10)T#10"]
[{"$f":"IF(D51=\" \",\" \",COUNT($A$46:A60)+1)","v":" "},"QD03",6,{"$f":"IF(_xlfn.CONCAT('QD03'!B38,\"\",'QD03'!C38)=\"\",\"\",_xlfn.CONCAT('QD03'!B38,\"\",'QD03'!C38))","v":"Apartamento202"},{"$f":"'QD03'!D38","v":"2º Pavimento"},{"$f":"'QD03'!C22","v":8450},{"$f":"'QD03'!E22","v":8.4499999999999993},{"$f":"'QD03'!E24","v":2.9574999999999996},{"$f":"'QD03'!$E$25","v":"NÃO"},{"$f":"'QD03'!$E$26","v":"M2"},{"$f":"VLOOKUP(J51,Tabelas!$A$2:$G$10,2,FALSE)","v":"MONOF "},1,{"$f":"_xlfn.CONCAT(\"DISJ \",K51,\" \",'QD03'!$E$28,\"A\")","v":"DISJ MONOF  50A"},"1#10(10)T#10"]
[{"$f":"IF(D52=\" \",\" \",COUNT($A$46:A61)+1)","v":" "},"QD03",7,{"$f":"IF(_xlfn.CONCAT('QD03'!B39,\"\",'QD03'!C39)=\"\",\"\",_xlfn.CONCAT('QD03'!B39,\"\",'QD03'!C39))","v":"Apartamento203"},{"$f":"'QD03'!D39","v":"2º Pavimento"},{"$f":"'QD03'!C22","v":8450},{"$f":"'QD03'!E22","v":8.4499999999999993},{"$f":"'QD03'!E24","v":2.9574999999999996},{"$f":"'QD03'!$E$25","v":"NÃO"},{"$f":"'QD03'!$E$26","v":"M2"},{"$f":"VLOOKUP(J52,Tabelas!$A$2:$G$10,2,FALSE)","v":"MONOF "},1,{"$f":"_xlfn.CONCAT(\"DISJ \",K52,\" \",'QD03'!$E$28,\"A\")","v":"DISJ MONOF  50A"},"1#10(10)T#10"]
[{"$f":"IF(D53=\" \",\" \",COUNT($A$46:A62)+1)","v":" "},"QD03",8,{"$f":"IF(_xlfn.CONCAT('QD03'!B40,\"\",'QD03'!C40)=\"\",\"\",_xlfn.CONCAT('QD03'!B40,\"\",'QD03'!C40))","v":"Apartamento204"},{"$f":"'QD03'!D40","v":"2º Pavimento"},{"$f":"'QD03'!C22","v":8450},{"$f":"'QD03'!E22","v":8.4499999999999993},{"$f":"'QD03'!E24","v":2.9574999999999996},{"$f":"'QD03'!$E$25","v":"NÃO"},{"$f":"'QD03'!$E$26","v":"M2"},{"$f":"VLOOKUP(J53,Tabelas!$A$2:$G$10,2,FALSE)","v":"MONOF "},1,{"$f":"_xlfn.CONCAT(\"DISJ \",K53,\" \",'QD03'!$E$28,\"A\")","v":"DISJ MONOF  50A"},"1#10(10)T#10"]
[{"$f":"IF(D54=\" \",\" \",COUNT($A$46:A63)+1)","v":" "},"QD03",9,{"$f":"IF(_xlfn.CONCAT('QD03'!B41,\"\",'QD03'!C41)=\"\",\"\",_xlfn.CONCAT('QD03'!B41,\"\",'QD03'!C41))","v":"Apartamento301"},{"$f":"'QD03'!D41","v":"3º Pavimento"},{"$f":"'QD03'!C22","v":8450},{"$f":"'QD03'!E22","v":8.4499999999999993},{"$f":"'QD03'!E24","v":2.9574999999999996},{"$f":"'QD03'!$E$25","v":"NÃO"},{"$f":"'QD03'!$E$26","v":"M2"},{"$f":"VLOOKUP(J54,Tabelas!$A$2:$G$10,2,FALSE)","v":"MONOF "},1,{"$f":"_xlfn.CONCAT(\"DISJ \",K54,\" \",'QD03'!$E$28,\"A\")","v":"DISJ MONOF  50A"},"1#10(10)T#10"]
[{"$f":"IF(D55=\" \",\" \",COUNT($A$46:A64)+1)","v":" "},"QD03",10,{"$f":"IF(_xlfn.CONCAT('QD03'!B42,\"\",'QD03'!C42)=\"\",\"\",_xlfn.CONCAT('QD03'!B42,\"\",'QD03'!C42))","v":"Apartamento302"},{"$f":"'QD03'!D42","v":"3º Pavimento"},{"$f":"'QD03'!C22","v":8450},{"$f":"'QD03'!E22","v":8.4499999999999993},{"$f":"'QD03'!E24","v":2.9574999999999996},{"$f":"'QD03'!$E$25","v":"NÃO"},{"$f":"'QD03'!$E$26","v":"M2"},{"$f":"VLOOKUP(J55,Tabelas!$A$2:$G$10,2,FALSE)","v":"MONOF "},1,{"$f":"_xlfn.CONCAT(\"DISJ \",K55,\" \",'QD03'!$E$28,\"A\")","v":"DISJ MONOF  50A"},"1#10(10)T#10"]
[{"$f":"IF(D56=\" \",\" \",COUNT($A$56:A65)+1)","v":" "},"QD04",1,{"$f":"IF(_xlfn.CONCAT('QD04'!B33,\"\",'QD04'!C33)=\"\",\"\",_xlfn.CONCAT('QD04'!B33,\"\",'QD04'!C33))","v":""},{"$f":"'QD04'!D33","v":0},{"$f":"'QD04'!C22","v":0},{"$f":"'QD04'!E22","v":0},{"$f":"'QD04'!E24","v":0},{"$f":"'QD04'!$E$25","v":"NÃO"},{"$f":"'QD04'!$E$26","v":"M1"},{"$f":"VLOOKUP(J56,Tabelas!$A$2:$G$10,2,FALSE)","v":"MONOF "},1,{"$f":"_xlfn.CONCAT(\"DISJ \",K56,\" \",'QD04'!$E$28,\"A\")","v":"DISJ MONOF  A"},"1#6(6)T#6"]
[{"$f":"IF(D57=\" \",\" \",COUNT($A$56:A66)+1)","v":" "},"QD04",2,{"$f":"IF(_xlfn.CONCAT('QD04'!B34,\"\",'QD04'!C34)=\"\",\"\",_xlfn.CONCAT('QD04'!B34,\"\",'QD04'!C34))","v":""},{"$f":"'QD04'!D34","v":0},{"$f":"'QD04'!C22","v":0},{"$f":"'QD04'!E22","v":0},{"$f":"'QD04'!E24","v":0},{"$f":"'QD04'!$E$25","v":"NÃO"},{"$f":"'QD04'!$E$26","v":"M1"},{"$f":"VLOOKUP(J57,Tabelas!$A$2:$G$10,2,FALSE)","v":"MONOF "},1,{"$f":"_xlfn.CONCAT(\"DISJ \",K57,\" \",'QD04'!$E$28,\"A\")","v":"DISJ MONOF  A"},"1#6(6)T#6"]
[{"$f":"IF(D58=\" \",\" \",COUNT($A$56:A67)+1)","v":" "},"QD04",3,{"$f":"IF(_xlfn.CONCAT('QD04'!B35,\"\",'QD04'!C35)=\"\",\"\",_xlfn.CONCAT('QD04'!B35,\"\",'QD04'!C35))","v":""},{"$f":"'QD04'!D35","v":0},{"$f":"'QD04'!C22","v":0},{"$f":"'QD04'!E22","v":0},{"$f":"'QD04'!E24","v":0},{"$f":"'QD04'!$E$25","v":"NÃO"},{"$f":"'QD04'!$E$26","v":"M1"},{"$f":"VLOOKUP(J58,Tabelas!$A$2:$G$10,2,FALSE)","v":"MONOF "},1,{"$f":"_xlfn.CONCAT(\"DISJ \",K58,\" \",'QD04'!$E$28,\"A\")","v":"DISJ MONOF  A"},"1#6(6)T#6"]
[{"$f":"IF(D59=\" \",\" \",COUNT($A$56:A68)+1)","v":" "},"QD04",4,{"$f":"IF(_xlfn.CONCAT('QD04'!B36,\"\",'QD04'!C36)=\"\",\"\",_xlfn.CONCAT('QD04'!B36,\"\",'QD04'!C36))","v":""},{"$f":"'QD04'!D36","v":0},{"$f":"'QD04'!C22","v":0},{"$f":"'QD04'!E22","v":0},{"$f":"'QD04'!E24","v":0},{"$f":"'QD04'!$E$25","v":"NÃO"},{"$f":"'QD04'!$E$26","v":"M1"},{"$f":"VLOOKUP(J59,Tabelas!$A$2:$G$10,2,FALSE)","v":"MONOF "},1,{"$f":"_xlfn.CONCAT(\"DISJ \",K59,\" \",'QD04'!$E$28,\"A\")","v":"DISJ MONOF  A"},"1#6(6)T#6"]
[{"$f":"IF(D60=\" \",\" \",COUNT($A$56:A69)+1)","v":" "},"QD04",5,{"$f":"IF(_xlfn.CONCAT('QD04'!B37,\"\",'QD04'!C37)=\"\",\"\",_xlfn.CONCAT('QD04'!B37,\"\",'QD04'!C37))","v":""},{"$f":"'QD04'!D37","v":0},{"$f":"'QD04'!C22","v":0},{"$f":"'QD04'!E22","v":0},{"$f":"'QD04'!E24","v":0},{"$f":"'QD04'!$E$25","v":"NÃO"},{"$f":"'QD04'!$E$26","v":"M1"},{"$f":"VLOOKUP(J60,Tabelas!$A$2:$G$10,2,FALSE)","v":"MONOF "},1,{"$f":"_xlfn.CONCAT(\"DISJ \",K60,\" \",'QD04'!$E$28,\"A\")","v":"DISJ MONOF  A"},"1#6(6)T#6"]
[{"$f":"IF(D61=\" \",\" \",COUNT($A$56:A70)+1)","v":" "},"QD04",6,{"$f":"IF(_xlfn.CONCAT('QD04'!B38,\"\",'QD04'!C38)=\"\",\"\",_xlfn.CONCAT('QD04'!B38,\"\",'QD04'!C38))","v":""},{"$f":"'QD04'!D38","v":0},{"$f":"'QD04'!C22","v":0},{"$f":"'QD04'!E22","v":0},{"$f":"'QD04'!E24","v":0},{"$f":"'QD04'!$E$25","v":"NÃO"},{"$f":"'QD04'!$E$26","v":"M1"},{"$f":"VLOOKUP(J61,Tabelas!$A$2:$G$10,2,FALSE)","v":"MONOF "},1,{"$f":"_xlfn.CONCAT(\"DISJ \",K61,\" \",'QD04'!$E$28,\"A\")","v":"DISJ MONOF  A"},"1#6(6)T#6"]
[{"$f":"IF(D62=\" \",\" \",COUNT($A$56:A71)+1)","v":" "},"QD04",7,{"$f":"IF(_xlfn.CONCAT('QD04'!B39,\"\",'QD04'!C39)=\"\",\"\",_xlfn.CONCAT('QD04'!B39,\"\",'QD04'!C39))","v":""},{"$f":"'QD04'!D39","v":0},{"$f":"'QD04'!C22","v":0},{"$f":"'QD04'!E22","v":0},{"$f":"'QD04'!E24","v":0},{"$f":"'QD04'!$E$25","v":"NÃO"},{"$f":"'QD04'!$E$26","v":"M1"},{"$f":"VLOOKUP(J62,Tabelas!$A$2:$G$10,2,FALSE)","v":"MONOF "},1,{"$f":"_xlfn.CONCAT(\"DISJ \",K62,\" \",'QD04'!$E$28,\"A\")","v":"DISJ MONOF  A"},"1#6(6)T#6"]
[{"$f":"IF(D63=\" \",\" \",COUNT($A$56:A72)+1)","v":" "},"QD04",8,{"$f":"IF(_xlfn.CONCAT('QD04'!B40,\"\",'QD04'!C40)=\"\",\"\",_xlfn.CONCAT('QD04'!B40,\"\",'QD04'!C40))","v":""},{"$f":"'QD04'!D40","v":0},{"$f":"'QD04'!C22","v":0},{"$f":"'QD04'!E22","v":0},{"$f":"'QD04'!E24","v":0},{"$f":"'QD04'!$E$25","v":"NÃO"},{"$f":"'QD04'!$E$26","v":"M1"},{"$f":"VLOOKUP(J63,Tabelas!$A$2:$G$10,2,FALSE)","v":"MONOF "},1,{"$f":"_xlfn.CONCAT(\"DISJ \",K63,\" \",'QD04'!$E$28,\"A\")","v":"DISJ MONOF  A"},"1#6(6)T#6"]
[{"$f":"IF(D64=\" \",\" \",COUNT($A$56:A73)+1)","v":" "},"QD04",9,{"$f":"IF(_xlfn.CONCAT('QD04'!B41,\"\",'QD04'!C41)=\"\",\"\",_xlfn.CONCAT('QD04'!B41,\"\",'QD04'!C41))","v":""},{"$f":"'QD04'!D41","v":0},{"$f":"'QD04'!C22","v":0},{"$f":"'QD04'!E22","v":0},{"$f":"'QD04'!E24","v":0},{"$f":"'QD04'!$E$25","v":"NÃO"},{"$f":"'QD04'!$E$26","v":"M1"},{"$f":"VLOOKUP(J64,Tabelas!$A$2:$G$10,2,FALSE)","v":"MONOF "},1,{"$f":"_xlfn.CONCAT(\"DISJ \",K64,\" \",'QD04'!$E$28,\"A\")","v":"DISJ MONOF  A"},"1#6(6)T#6"]
[{"$f":"IF(D65=\" \",\" \",COUNT($A$56:A74)+1)","v":" "},"QD04",10,{"$f":"IF(_xlfn.CONCAT('QD04'!B42,\"\",'QD04'!C42)=\"\",\"\",_xlfn.CONCAT('QD04'!B42,\"\",'QD04'!C42))","v":""},{"$f":"'QD04'!D42","v":0},{"$f":"'QD04'!C22","v":0},{"$f":"'QD04'!E22","v":0},{"$f":"'QD04'!E24","v":0},{"$f":"'QD04'!$E$25","v":"NÃO"},{"$f":"'QD04'!$E$26","v":"M1"},{"$f":"VLOOKUP(J65,Tabelas!$A$2:$G$10,2,FALSE)","v":"MONOF "},1,{"$f":"_xlfn.CONCAT(\"DISJ \",K65,\" \",'QD04'!$E$28,\"A\")","v":"DISJ MONOF  A"},"1#6(6)T#6"]
[{"$f":"IF(D66=0,\"\",COUNT($A$6:A65)+1)","v":{"$error":"#REF!"}},"QD05",1,{"$f":"IF(_xlfn.CONCAT('QD05'!B33,\"\",'QD05'!C33)=\"\",\"\",_xlfn.CONCAT('QD05'!B33,\"\",'QD05'!C33))","v":""},{"$f":"'QD05'!D33","v":0},{"$f":"'QD05'!C22","v":0},{"$f":"'QD05'!E22","v":0},{"$f":"'QD05'!E24","v":0},{"$f":"'QD05'!$E$25","v":"NÃO"},{"$f":"'QD05'!$E$26","v":"M1"},{"$f":"VLOOKUP(J66,Tabelas!$A$2:$G$10,2,FALSE)","v":"MONOF "},1,{"$f":"_xlfn.CONCAT(\"DISJ \",K66,\" \",'QD05'!$E$28,\"A\")","v":"DISJ MONOF  A"},"1#6(6)T#6"]
[{"$f":"IF(D67=0,\"\",COUNT($A$6:A66)+1)","v":{"$error":"#REF!"}},"QD05",2,{"$f":"IF(_xlfn.CONCAT('QD05'!B34,\"\",'QD05'!C34)=\"\",\"\",_xlfn.CONCAT('QD05'!B34,\"\",'QD05'!C34))","v":""},{"$f":"'QD05'!D34","v":0},{"$f":"'QD05'!C22","v":0},{"$f":"'QD05'!E22","v":0},{"$f":"'QD05'!E24","v":0},{"$f":"'QD05'!$E$25","v":"NÃO"},{"$f":"'QD05'!$E$26","v":"M1"},{"$f":"VLOOKUP(J67,Tabelas!$A$2:$G$10,2,FALSE)","v":"MONOF "},1,{"$f":"_xlfn.CONCAT(\"DISJ \",K67,\" \",'QD05'!$E$28,\"A\")","v":"DISJ MONOF  A"},"1#6(6)T#6"]
[{"$f":"IF(D68=0,\"\",COUNT($A$6:A67)+1)","v":{"$error":"#REF!"}},"QD05",3,{"$f":"IF(_xlfn.CONCAT('QD05'!B35,\"\",'QD05'!C35)=\"\",\"\",_xlfn.CONCAT('QD05'!B35,\"\",'QD05'!C35))","v":""},{"$f":"'QD05'!D35","v":0},{"$f":"'QD05'!C22","v":0},{"$f":"'QD05'!E22","v":0},{"$f":"'QD05'!E24","v":0},{"$f":"'QD05'!$E$25","v":"NÃO"},{"$f":"'QD05'!$E$26","v":"M1"},{"$f":"VLOOKUP(J68,Tabelas!$A$2:$G$10,2,FALSE)","v":"MONOF "},1,{"$f":"_xlfn.CONCAT(\"DISJ \",K68,\" \",'QD05'!$E$28,\"A\")","v":"DISJ MONOF  A"},"1#6(6)T#6"]
[{"$f":"IF(D69=0,\"\",COUNT($A$6:A68)+1)","v":{"$error":"#REF!"}},"QD05",4,{"$f":"IF(_xlfn.CONCAT('QD05'!B36,\"\",'QD05'!C36)=\"\",\"\",_xlfn.CONCAT('QD05'!B36,\"\",'QD05'!C36))","v":""},{"$f":"'QD05'!D36","v":0},{"$f":"'QD05'!C22","v":0},{"$f":"'QD05'!E22","v":0},{"$f":"'QD05'!E24","v":0},{"$f":"'QD05'!$E$25","v":"NÃO"},{"$f":"'QD05'!$E$26","v":"M1"},{"$f":"VLOOKUP(J69,Tabelas!$A$2:$G$10,2,FALSE)","v":"MONOF "},1,{"$f":"_xlfn.CONCAT(\"DISJ \",K69,\" \",'QD05'!$E$28,\"A\")","v":"DISJ MONOF  A"},"1#6(6)T#6"]
[{"$f":"IF(D70=0,\"\",COUNT($A$6:A69)+1)","v":{"$error":"#REF!"}},"QD05",5,{"$f":"IF(_xlfn.CONCAT('QD05'!B37,\"\",'QD05'!C37)=\"\",\"\",_xlfn.CONCAT('QD05'!B37,\"\",'QD05'!C37))","v":""},{"$f":"'QD05'!D37","v":0},{"$f":"'QD05'!C22","v":0},{"$f":"'QD05'!E22","v":0},{"$f":"'QD05'!E24","v":0},{"$f":"'QD05'!$E$25","v":"NÃO"},{"$f":"'QD05'!$E$26","v":"M1"},{"$f":"VLOOKUP(J70,Tabelas!$A$2:$G$10,2,FALSE)","v":"MONOF "},1,{"$f":"_xlfn.CONCAT(\"DISJ \",K70,\" \",'QD05'!$E$28,\"A\")","v":"DISJ MONOF  A"},"1#6(6)T#6"]
[{"$f":"IF(D71=0,\"\",COUNT($A$6:A70)+1)","v":{"$error":"#REF!"}},"QD05",6,{"$f":"IF(_xlfn.CONCAT('QD05'!B38,\"\",'QD05'!C38)=\"\",\"\",_xlfn.CONCAT('QD05'!B38,\"\",'QD05'!C38))","v":""},{"$f":"'QD05'!D38","v":0},{"$f":"'QD05'!C22","v":0},{"$f":"'QD05'!E22","v":0},{"$f":"'QD05'!E24","v":0},{"$f":"'QD05'!$E$25","v":"NÃO"},{"$f":"'QD05'!$E$26","v":"M1"},{"$f":"VLOOKUP(J71,Tabelas!$A$2:$G$10,2,FALSE)","v":"MONOF "},{"$f":"IF(K71=\"MONOF \",1,IF(K71=\"BIF \",2,IF(K71=\"TRIF \",3,\"\")))","v":1},{"$f":"_xlfn.CONCAT(\"DISJ \",K71,\" \",'QD05'!$E$28,\"A\")","v":"DISJ MONOF  A"},"1#6(6)T#6"]
[{"$f":"IF(D72=0,\"\",COUNT($A$6:A71)+1)","v":{"$error":"#REF!"}},"QD05",7,{"$f":"IF(_xlfn.CONCAT('QD05'!B39,\"\",'QD05'!C39)=\"\",\"\",_xlfn.CONCAT('QD05'!B39,\"\",'QD05'!C39))","v":""},{"$f":"'QD05'!D39","v":0},{"$f":"'QD05'!C22","v":0},{"$f":"'QD05'!E22","v":0},{"$f":"'QD05'!E24","v":0},{"$f":"'QD05'!$E$25","v":"NÃO"},{"$f":"'QD05'!$E$26","v":"M1"},{"$f":"VLOOKUP(J72,Tabelas!$A$2:$G$10,2,FALSE)","v":"MONOF "},1,{"$f":"_xlfn.CONCAT(\"DISJ \",K72,\" \",'QD05'!$E$28,\"A\")","v":"DISJ MONOF  A"},"1#6(6)T#6"]
[{"$f":"IF(D73=0,\"\",COUNT($A$6:A72)+1)","v":{"$error":"#REF!"}},"QD05",8,{"$f":"IF(_xlfn.CONCAT('QD05'!B40,\"\",'QD05'!C40)=\"\",\"\",_xlfn.CONCAT('QD05'!B40,\"\",'QD05'!C40))","v":""},{"$f":"'QD05'!D40","v":0},{"$f":"'QD05'!C22","v":0},{"$f":"'QD05'!E22","v":0},{"$f":"'QD05'!E24","v":0},{"$f":"'QD05'!$E$25","v":"NÃO"},{"$f":"'QD05'!$E$26","v":"M1"},{"$f":"VLOOKUP(J73,Tabelas!$A$2:$G$10,2,FALSE)","v":"MONOF "},1,{"$f":"_xlfn.CONCAT(\"DISJ \",K73,\" \",'QD05'!$E$28,\"A\")","v":"DISJ MONOF  A"},"1#6(6)T#6"]
[null,"QD05",9,{"$f":"IF(_xlfn.CONCAT('QD05'!B41,\"\",'QD05'!C41)=\"\",\"\",_xlfn.CONCAT('QD05'!B41,\"\",'QD05'!C41))","v":""},{"$f":"'QD05'!D41","v":0},{"$f":"'QD05'!C22","v":0},{"$f":"'QD05'!E22","v":0},{"$f":"'QD05'!E24","v":0},{"$f":"'QD05'!$E$25","v":"NÃO"},{"$f":"'QD05'!$E$26","v":"M1"},{"$f":"VLOOKUP(J74,Tabelas!$A$2:$G$10,2,FALSE)","v":"MONOF "},1,{"$f":"_xlfn.CONCAT(\"DISJ \",K74,\" \",'QD05'!$E$28,\"A\")","v":"DISJ MONOF  A"},"1#6(6)T#6"]
[null,"QD05",10,{"$f":"IF(_xlfn.CONCAT('QD05'!B42,\"\",'QD05'!C42)=\"\",\"\",_xlfn.CONCAT('QD05'!B42,\"\",'QD05'!C42))","v":""},{"$f":"'QD05'!D42","v":0},{"$f":"'QD05'!C22","v":0},{"$f":"'QD05'!E22","v":0},{"$f":"'QD05'!E24","v":0},{"$f":"'QD05'!$E$25","v":"NÃO"},{"$f":"'QD05'!$E$26","v":"M1"},{"$f":"VLOOKUP(J75,Tabelas!$A$2:$G$10,2,FALSE)","v":"MONOF "},1,{"$f":"_xlfn.CONCAT(\"DISJ \",K75,\" \",'QD05'!$E$28,\"A\")","v":"DISJ MONOF  A"},"1#6(6)T#6"]

{"sheet":"Medições","index":9,"n_rows":104,"n_cols":14,"rows_kept":104,"cut":false,"hidden":false,"merged":[[1,3,1,9],[2,3,3,14],[1,10,1,14],[15,3,16,14],[5,3,5,8],[7,3,7,8],[8,3,8,8],[12,3,12,8],[6,11,6,12],[5,11,5,12],[13,13,14,14],[13,12,14,12],[13,11,14,11],[13,10,14,10],[13,9,14,9],[17,13,17,14],[18,13,18,14],[12,13,12,14],[13,3,14,8],[7,10,7,13],[19,13,19,14],[20,13,20,14],[21,13,21,14],[22,13,22,14],[23,13,23,14],[24,13,24,14],[25,13,25,14],[26,13,26,14],[27,13,27,14],[28,13,28,14],[29,13,29,14],[30,13,30,14],[31,13,31,14],[32,13,32,14],[33,13,33,14],[40,13,40,14],[41,13,41,14],[42,13,42,14],[43,13,43,14],[34,13,34,14],[35,13,35,14],[36,13,36,14],[37,13,37,14],[38,13,38,14],[54,13,54,14],[55,13,55,14],[56,13,56,14],[57,13,57,14],[10,3,11,14],[49,13,49,14],[50,13,50,14],[51,13,51,14],[52,13,52,14],[53,13,53,14],[44,13,44,14],[45,13,45,14],[46,13,46,14],[47,13,47,14],[48,13,48,14],[39,13,39,14]]}
[]
[null,null,null,null,null,null,null,null,null,null,"Painel Coletivo - Interligação Neoenergia Brasília"]
[null,null,null,"Dados Básicos do Painel de Medição"]
[]
[]
[null,null,null,"Tipo de painel:",null,null,null,null,null,"Madeira",null,"Localização do PM",null,"TERREO "]
[null,null,null,null,null,null,null,null,null,null,null,"Medição de Incêndio",null,"Sim"]
[null,null,null,"Ligações na caixa DF:",null,null,null,null,null,19]
[null,null,null,"Tipo de caixa DF:",null,null,null,null,null,"DF-24"]
[]
[null,null,null,"Dados da medição de Incêndio"]
[]
[null,null,null,"Identificação",null,null,null,null,null,"Carga instalada","Demanda","Disjuntor","Cabos","Caixa de medição"]
[null,null,null,{"$f":"DadosMedições!B4","v":"QDINC"},null,null,null,null,null,{"$f":"DadosMedições!F4","v":20000},{"$f":"DadosMedições!H4","v":10},{"$f":"DadosMedições!M4","v":"DISJ TRIF  32A"},{"$f":"DadosMedições!N4","v":"3#6(6)T#6"},{"$f":"DadosMedições!O4","v":"P1"}]
[]
[null,null,null,"Dados das medições das unidades consumidoras"]
[]
[null,null,null,"Identificação  ",null,null,null,null,null,"Carga instalada","Demanda","Disjuntor","Cabos","Tipo de painel"]
[null,null,null,{"$f":"_xlfn._xlws.FILTER(DadosMedições!$D$6:$D$75, DadosMedições!$D$6:$D$75<>\"\" )","v":"Serviço1"},null,null,null,null,null,{"$f":"IFERROR(VLOOKUP(D19,DadosMedições!$D$6:$O$75,3,FALSE),\"\")","v":1250},{"$f":"IFERROR(VLOOKUP(D19,DadosMedições!$D$6:$O$75,5,FALSE),\"\")","v":0.625},{"$f":"IFERROR(VLOOKUP(D19,DadosMedições!$D$6:$O$75,10,FALSE),\"\")","v":"DISJ MONOF  32A"},{"$f":"IFERROR(VLOOKUP(D19,DadosMedições!$D$6:$O$75,11,FALSE),\"\")","v":"1#6(6)T#6"},"A"]
[null,null,null,"Loja1",null,null,null,null,null,{"$f":"IFERROR(VLOOKUP(D20,DadosMedições!$D$6:$O$75,3,FALSE),\"\")","v":5070},{"$f":"IFERROR(VLOOKUP(D20,DadosMedições!$D$6:$O$75,5,FALSE),\"\")","v":4.6137000000000006},{"$f":"IFERROR(VLOOKUP(D20,DadosMedições!$D$6:$O$75,10,FALSE),\"\")","v":"DISJ TRIF  32A"},{"$f":"IFERROR(VLOOKUP(D20,DadosMedições!$D$6:$O$75,11,FALSE),\"\")","v":"3#6(6)T#6"},"B"]
[null,null,null,"Loja2",null,null,null,null,null,{"$f":"IFERROR(VLOOKUP(D21,DadosMedições!$D$6:$O$75,3,FALSE),\"\")","v":5070},{"$f":"IFERROR(VLOOKUP(D21,DadosMedições!$D$6:$O$75,5,FALSE),\"\")","v":4.6137000000000006},{"$f":"IFERROR(VLOOKUP(D21,DadosMedições!$D$6:$O$75,10,FALSE),\"\")","v":"DISJ TRIF  32A"},{"$f":"IFERROR(VLOOKUP(D21,DadosMedições!$D$6:$O$75,11,FALSE),\"\")","v":"3#6(6)T#6"},"B"]
[null,null,null,"Apartamento101",null,null,null,null,null,{"$f":"IFERROR(VLOOKUP(D22,DadosMedições!$D$6:$O$75,3,FALSE),\"\")","v":8450},{"$f":"IFERROR(VLOOKUP(D22,DadosMedições!$D$6:$O$75,5,FALSE),\"\")","v":2.9574999999999996},{"$f":"IFERROR(VLOOKUP(D22,DadosMedições!$D$6:$O$75,10,FALSE),\"\")","v":"DISJ MONOF  50A"},{"$f":"IFERROR(VLOOKUP(D22,DadosMedições!$D$6:$O$75,11,FALSE),\"\")","v":"1#10(10)T#10"},"A"]
[null,null,null,"Apartamento102",null,null,null,null,null,{"$f":"IFERROR(VLOOKUP(D23,DadosMedições!$D$6:$O$75,3,FALSE),\"\")","v":8450},{"$f":"IFERROR(VLOOKUP(D23,DadosMedições!$D$6:$O$75,5,FALSE),\"\")","v":2.9574999999999996},{"$f":"IFERROR(VLOOKUP(D23,DadosMedições!$D$6:$O$75,10,FALSE),\"\")","v":"DISJ MONOF  50A"},{"$f":"IFERROR(VLOOKUP(D23,DadosMedições!$D$6:$O$75,11,FALSE),\"\")","v":"1#10(10)T#10"},"A"]
[null,null,null,"Apartamento103",null,null,null,null,null,{"$f":"IFERROR(VLOOKUP(D24,DadosMedições!$D$6:$O$75,3,FALSE),\"\")","v":8450},{"$f":"IFERROR(VLOOKUP(D24,DadosMedições!$D$6:$O$75,5,FALSE),\"\")","v":2.9574999999999996},{"$f":"IFERROR(VLOOKUP(D24,DadosMedições!$D$6:$O$75,10,FALSE),\"\")","v":"DISJ MONOF  50A"},{"$f":"IFERROR(VLOOKUP(D24,DadosMedições!$D$6:$O$75,11,FALSE),\"\")","v":"1#10(10)T#10"},"A"]
[null,null,null,"Apartamento104",null,null,null,null,null,{"$f":"IFERROR(VLOOKUP(D25,DadosMedições!$D$6:$O$75,3,FALSE),\"\")","v":8450},{"$f":"IFERROR(VLOOKUP(D25,DadosMedições!$D$6:$O$75,5,FALSE),\"\")","v":2.9574999999999996},{"$f":"IFERROR(VLOOKUP(D25,DadosMedições!$D$6:$O$75,10,FALSE),\"\")","v":"DISJ MONOF  50A"},{"$f":"IFERROR(VLOOKUP(D25,DadosMedições!$D$6:$O$75,11,FALSE),\"\")","v":"1#10(10)T#10"},"A"]
[null,null,null,"Apartamento201",null,null,null,null,null,{"$f":"IFERROR(VLOOKUP(D26,DadosMedições!$D$6:$O$75,3,FALSE),\"\")","v":8450},{"$f":"IFERROR(VLOOKUP(D26,DadosMedições!$D$6:$O$75,5,FALSE),\"\")","v":2.9574999999999996},{"$f":"IFERROR(VLOOKUP(D26,DadosMedições!$D$6:$O$75,10,FALSE),\"\")","v":"DISJ MONOF  50A"},{"$f":"IFERROR(VLOOKUP(D26,DadosMedições!$D$6:$O$75,11,FALSE),\"\")","v":"1#10(10)T#10"},"A"]
[null,null,null,"Apartamento202",null,null,null,null,null,{"$f":"IFERROR(VLOOKUP(D27,DadosMedições!$D$6:$O$75,3,FALSE),\"\")","v":8450},{"$f":"IFERROR(VLOOKUP(D27,DadosMedições!$D$6:$O$75,5,FALSE),\"\")","v":2.9574999999999996},{"$f":"IFERROR(VLOOKUP(D27,DadosMedições!$D$6:$O$75,10,FALSE),\"\")","v":"DISJ MONOF  50A"},{"$f":"IFERROR(VLOOKUP(D27,DadosMedições!$D$6:$O$75,11,FALSE),\"\")","v":"1#10(10)T#10"},"A"]
[null,null,null,"Apartamento203",null,null,null,null,null,{"$f":"IFERROR(VLOOKUP(D28,DadosMedições!$D$6:$O$75,3,FALSE),\"\")","v":8450},{"$f":"IFERROR(VLOOKUP(D28,DadosMedições!$D$6:$O$75,5,FALSE),\"\")","v":2.9574999999999996},{"$f":"IFERROR(VLOOKUP(D28,DadosMedições!$D$6:$O$75,10,FALSE),\"\")","v":"DISJ MONOF  50A"},{"$f":"IFERROR(VLOOKUP(D28,DadosMedições!$D$6:$O$75,11,FALSE),\"\")","v":"1#10(10)T#10"},"A"]
[null,null,null,"Apartamento204",null,null,null,null,null,{"$f":"IFERROR(VLOOKUP(D29,DadosMedições!$D$6:$O$75,3,FALSE),\"\")","v":8450},{"$f":"IFERROR(VLOOKUP(D29,DadosMedições!$D$6:$O$75,5,FALSE),\"\")","v":2.9574999999999996},{"$f":"IFERROR(VLOOKUP(D29,DadosMedições!$D$6:$O$75,10,FALSE),\"\")","v":"DISJ MONOF  50A"},{"$f":"IFERROR(VLOOKUP(D29,DadosMedições!$D$6:$O$75,11,FALSE),\"\")","v":"1#10(10)T#10"},"A"]
[null,null,null,"Apartamento301",null,null,null,null,null,{"$f":"IFERROR(VLOOKUP(D30,DadosMedições!$D$6:$O$75,3,FALSE),\"\")","v":8450},{"$f":"IFERROR(VLOOKUP(D30,DadosMedições!$D$6:$O$75,5,FALSE),\"\")","v":2.9574999999999996},{"$f":"IFERROR(VLOOKUP(D30,DadosMedições!$D$6:$O$75,10,FALSE),\"\")","v":"DISJ MONOF  50A"},{"$f":"IFERROR(VLOOKUP(D30,DadosMedições!$D$6:$O$75,11,FALSE),\"\")","v":"1#10(10)T#10"},"A"]
[null,null,null,"Apartamento302",null,null,null,null,null,{"$f":"IFERROR(VLOOKUP(D31,DadosMedições!$D$6:$O$75,3,FALSE),\"\")","v":8450},{"$f":"IFERROR(VLOOKUP(D31,DadosMedições!$D$6:$O$75,5,FALSE),\"\")","v":2.9574999999999996},{"$f":"IFERROR(VLOOKUP(D31,DadosMedições!$D$6:$O$75,10,FALSE),\"\")","v":"DISJ MONOF  50A"},{"$f":"IFERROR(VLOOKUP(D31,DadosMedições!$D$6:$O$75,11,FALSE),\"\")","v":"1#10(10)T#10"},"A"]
[null,null,null,null,null,null,null,null,null,{"$f":"IFERROR(VLOOKUP(D32,DadosMedições!$D$6:$O$75,3,FALSE),\"\")","v":""},{"$f":"IFERROR(VLOOKUP(D32,DadosMedições!$D$6:$O$75,5,FALSE),\"\")","v":""},{"$f":"IFERROR(VLOOKUP(D32,DadosMedições!$D$6:$O$75,10,FALSE),\"\")","v":""},{"$f":"IFERROR(VLOOKUP(D32,DadosMedições!$D$6:$O$75,11,FALSE),\"\")","v":""}]
[null,null,null,null,null,null,null,null,null,{"$f":"IFERROR(VLOOKUP(D33,DadosMedições!$D$6:$O$75,3,FALSE),\"\")","v":""},{"$f":"IFERROR(VLOOKUP(D33,DadosMedições!$D$6:$O$75,5,FALSE),\"\")","v":""},{"$f":"IFERROR(VLOOKUP(D33,DadosMedições!$D$6:$O$75,10,FALSE),\"\")","v":""},{"$f":"IFERROR(VLOOKUP(D33,DadosMedições!$D$6:$O$75,11,FALSE),\"\")","v":""}]
[null,null,null,null,null,null,null,null,null,{"$f":"IFERROR(VLOOKUP(D34,DadosMedições!$D$6:$O$75,3,FALSE),\"\")","v":""},{"$f":"IFERROR(VLOOKUP(D34,DadosMedições!$D$6:$O$75,5,FALSE),\"\")","v":""},{"$f":"IFERROR(VLOOKUP(D34,DadosMedições!$D$6:$O$75,10,FALSE),\"\")","v":""},{"$f":"IFERROR(VLOOKUP(D34,DadosMedições!$D$6:$O$75,11,FALSE),\"\")","v":""}]
[null,null,null,null,null,null,null,null,null,{"$f":"IFERROR(VLOOKUP(D35,DadosMedições!$D$6:$O$75,3,FALSE),\"\")","v":""},{"$f":"IFERROR(VLOOKUP(D35,DadosMedições!$D$6:$O$75,5,FALSE),\"\")","v":""},{"$f":"IFERROR(VLOOKUP(D35,DadosMedições!$D$6:$O$75,10,FALSE),\"\")","v":""},{"$f":"IFERROR(VLOOKUP(D35,DadosMedições!$D$6:$O$75,11,FALSE),\"\")","v":""}]
[null,null,null,null,null,null,null,null,null,{"$f":"IFERROR(VLOOKUP(D36,DadosMedições!$D$6:$O$75,3,FALSE),\"\")","v":""},{"$f":"IFERROR(VLOOKUP(D36,DadosMedições!$D$6:$O$75,5,FALSE),\"\")","v":""},{"$f":"IFERROR(VLOOKUP(D36,DadosMedições!$D$6:$O$75,10,FALSE),\"\")","v":""},{"$f":"IFERROR(VLOOKUP(D36,DadosMedições!$D$6:$O$75,11,FALSE),\"\")","v":""}]
[null,null,null,null,null,null,null,null,null,{"$f":"IFERROR(VLOOKUP(D37,DadosMedições!$D$6:$O$75,3,FALSE),\"\")","v":""},{"$f":"IFERROR(VLOOKUP(D37,DadosMedições!$D$6:$O$75,5,FALSE),\"\")","v":""},{"$f":"IFERROR(VLOOKUP(D37,DadosMedições!$D$6:$O$75,10,FALSE),\"\")","v":""},{"$f":"IFERROR(VLOOKUP(D37,DadosMedições!$D$6:$O$75,11,FALSE),\"\")","v":""}]
[null,null,null,null,null,null,null,null,null,{"$f":"IFERROR(VLOOKUP(D38,DadosMedições!$D$6:$O$75,3,FALSE),\"\")","v":""},{"$f":"IFERROR(VLOOKUP(D38,DadosMedições!$D$6:$O$75,5,FALSE),\"\")","v":""},{"$f":"IFERROR(VLOOKUP(D38,DadosMedições!$D$6:$O$75,10,FALSE),\"\")","v":""},{"$f":"IFERROR(VLOOKUP(D38,DadosMedições!$D$6:$O$75,11,FALSE),\"\")","v":""}]
[null,null,null,null,null,null,null,null,null,{"$f":"IFERROR(VLOOKUP(D39,DadosMedições!$D$6:$O$75,3,FALSE),\"\")","v":""},{"$f":"IFERROR(VLOOKUP(D39,DadosMedições!$D$6:$O$75,5,FALSE),\"\")","v":""},{"$f":"IFERROR(VLOOKUP(D39,DadosMedições!$D$6:$O$75,10,FALSE),\"\")","v":""},{"$f":"IFERROR(VLOOKUP(D39,DadosMedições!$D$6:$O$75,11,FALSE),\"\")","v":""}]
[null,null,null,null,null,null,null,null,null,{"$f":"IFERROR(VLOOKUP(D40,DadosMedições!$D$6:$O$75,3,FALSE),\"\")","v":""},{"$f":"IFERROR(VLOOKUP(D40,DadosMedições!$D$6:$O$75,5,FALSE),\"\")","v":""},{"$f":"IFERROR(VLOOKUP(D40,DadosMedições!$D$6:$O$75,10,FALSE),\"\")","v":""},{"$f":"IFERROR(VLOOKUP(D40,DadosMedições!$D$6:$O$75,11,FALSE),\"\")","v":""}]
[null,null,null,null,null,null,null,null,null,{"$f":"IFERROR(VLOOKUP(D41,DadosMedições!$D$6:$O$75,3,FALSE),\"\")","v":""},{"$f":"IFERROR(VLOOKUP(D41,DadosMedições!$D$6:$O$75,5,FALSE),\"\")","v":""},{"$f":"IFERROR(VLOOKUP(D41,DadosMedições!$D$6:$O$75,10,FALSE),\"\")","v":""},{"$f":"IFERROR(VLOOKUP(D41,DadosMedições!$D$6:$O$75,11,FALSE),\"\")","v":""}]
[null,null,null,null,null,null,null,null,null,{"$f":"IFERROR(VLOOKUP(D42,DadosMedições!$D$6:$O$75,3,FALSE),\"\")","v":""},{"$f":"IFERROR(VLOOKUP(D42,DadosMedições!$D$6:$O$75,5,FALSE),\"\")","v":""},{"$f":"IFERROR(VLOOKUP(D42,DadosMedições!$D$6:$O$75,10,FALSE),\"\")","v":""},{"$f":"IFERROR(VLOOKUP(D42,DadosMedições!$D$6:$O$75,11,FALSE),\"\")","v":""}]
[null,null,null,null,null,null,null,null,null,{"$f":"IFERROR(VLOOKUP(D43,DadosMedições!$D$6:$O$75,3,FALSE),\"\")","v":""},{"$f":"IFERROR(VLOOKUP(D43,DadosMedições!$D$6:$O$75,5,FALSE),\"\")","v":""},{"$f":"IFERROR(VLOOKUP(D43,DadosMedições!$D$6:$O$75,10,FALSE),\"\")","v":""},{"$f":"IFERROR(VLOOKUP(D43,DadosMedições!$D$6:$O$75,11,FALSE),\"\")","v":""}]
[null,null,null,null,null,null,null,null,null,{"$f":"IFERROR(VLOOKUP(D44,DadosMedições!$D$6:$O$75,3,FALSE),\"\")","v":""},{"$f":"IFERROR(VLOOKUP(D44,DadosMedições!$D$6:$O$75,5,FALSE),\"\")","v":""},{"$f":"IFERROR(VLOOKUP(D44,DadosMedições!$D$6:$O$75,10,FALSE),\"\")","v":""},{"$f":"IFERROR(VLOOKUP(D44,DadosMedições!$D$6:$O$75,11,FALSE),\"\")","v":""}]
[null,null,null,null,null,null,null,null,null,{"$f":"IFERROR(VLOOKUP(D45,DadosMedições!$D$6:$O$75,3,FALSE),\"\")","v":""},{"$f":"IFERROR(VLOOKUP(D45,DadosMedições!$D$6:$O$75,5,FALSE),\"\")","v":""},{"$f":"IFERROR(VLOOKUP(D45,DadosMedições!$D$6:$O$75,10,FALSE),\"\")","v":""},{"$f":"IFERROR(VLOOKUP(D45,DadosMedições!$D$6:$O$75,11,FALSE),\"\")","v":""}]
[null,null,null,null,null,null,null,null,null,{"$f":"IFERROR(VLOOKUP(D46,DadosMedições!$D$6:$O$75,3,FALSE),\"\")","v":""},{"$f":"IFERROR(VLOOKUP(D46,DadosMedições!$D$6:$O$75,5,FALSE),\"\")","v":""},{"$f":"IFERROR(VLOOKUP(D46,DadosMedições!$D$6:$O$75,10,FALSE),\"\")","v":""},{"$f":"IFERROR(VLOOKUP(D46,DadosMedições!$D$6:$O$75,11,FALSE),\"\")","v":""}]
[null,null,null,null,null,null,null,null,null,{"$f":"IFERROR(VLOOKUP(D47,DadosMedições!$D$6:$O$75,3,FALSE),\"\")","v":""},{"$f":"IFERROR(VLOOKUP(D47,DadosMedições!$D$6:$O$75,5,FALSE),\"\")","v":""},{"$f":"IFERROR(VLOOKUP(D47,DadosMedições!$D$6:$O$75,10,FALSE),\"\")","v":""},{"$f":"IFERROR(VLOOKUP(D47,DadosMedições!$D$6:$O$75,11,FALSE),\"\")","v":""}]
[null,null,null,null,null,null,null,null,null,{"$f":"IFERROR(VLOOKUP(D48,DadosMedições!$D$6:$O$75,3,FALSE),\"\")","v":""},{"$f":"IFERROR(VLOOKUP(D48,DadosMedições!$D$6:$O$75,5,FALSE),\"\")","v":""},{"$f":"IFERROR(VLOOKUP(D48,DadosMedições!$D$6:$O$75,10,FALSE),\"\")","v":""},{"$f":"IFERROR(VLOOKUP(D48,DadosMedições!$D$6:$O$75,11,FALSE),\"\")","v":""}]
[null,null,null,null,null,null,null,null,null,{"$f":"IFERROR(VLOOKUP(D49,DadosMedições!$D$6:$O$75,3,FALSE),\"\")","v":""},{"$f":"IFERROR(VLOOKUP(D49,DadosMedições!$D$6:$O$75,5,FALSE),\"\")","v":""},{"$f":"IFERROR(VLOOKUP(D49,DadosMedições!$D$6:$O$75,10,FALSE),\"\")","v":""},{"$f":"IFERROR(VLOOKUP(D49,DadosMedições!$D$6:$O$75,11,FALSE),\"\")","v":""}]
[null,null,null,null,null,null,null,null,null,{"$f":"IFERROR(VLOOKUP(D50,DadosMedições!$D$6:$O$75,3,FALSE),\"\")","v":""},{"$f":"IFERROR(VLOOKUP(D50,DadosMedições!$D$6:$O$75,5,FALSE),\"\")","v":""},{"$f":"IFERROR(VLOOKUP(D50,DadosMedições!$D$6:$O$75,10,FALSE),\"\")","v":""},{"$f":"IFERROR(VLOOKUP(D50,DadosMedições!$D$6:$O$75,11,FALSE),\"\")","v":""}]
[null,null,null,null,null,null,null,null,null,{"$f":"IFERROR(VLOOKUP(D51,DadosMedições!$D$6:$O$75,3,FALSE),\"\")","v":""},{"$f":"IFERROR(VLOOKUP(D51,DadosMedições!$D$6:$O$75,5,FALSE),\"\")","v":""},{"$f":"IFERROR(VLOOKUP(D51,DadosMedições!$D$6:$O$75,10,FALSE),\"\")","v":""},{"$f":"IFERROR(VLOOKUP(D51,DadosMedições!$D$6:$O$75,11,FALSE),\"\")","v":""}]
[null,null,null,null,null,null,null,null,null,{"$f":"IFERROR(VLOOKUP(D52,DadosMedições!$D$6:$O$75,3,FALSE),\"\")","v":""},{"$f":"IFERROR(VLOOKUP(D52,DadosMedições!$D$6:$O$75,5,FALSE),\"\")","v":""},{"$f":"IFERROR(VLOOKUP(D52,DadosMedições!$D$6:$O$75,10,FALSE),\"\")","v":""},{"$f":"IFERROR(VLOOKUP(D52,DadosMedições!$D$6:$O$75,11,FALSE),\"\")","v":""}]
[null,null,null,null,null,null,null,null,null,{"$f":"IFERROR(VLOOKUP(D53,DadosMedições!$D$6:$O$75,3,FALSE),\"\")","v":""},{"$f":"IFERROR(VLOOKUP(D53,DadosMedições!$D$6:$O$75,5,FALSE),\"\")","v":""},{"$f":"IFERROR(VLOOKUP(D53,DadosMedições!$D$6:$O$75,10,FALSE),\"\")","v":""},{"$f":"IFERROR(VLOOKUP(D53,DadosMedições!$D$6:$O$75,11,FALSE),\"\")","v":""}]
[null,null,null,null,null,null,null,null,null,{"$f":"IFERROR(VLOOKUP(D54,DadosMedições!$D$6:$O$75,3,FALSE),\"\")","v":""},{"$f":"IFERROR(VLOOKUP(D54,DadosMedições!$D$6:$O$75,5,FALSE),\"\")","v":""},{"$f":"IFERROR(VLOOKUP(D54,DadosMedições!$D$6:$O$75,10,FALSE),\"\")","v":""},{"$f":"IFERROR(VLOOKUP(D54,DadosMedições!$D$6:$O$75,11,FALSE),\"\")","v":""}]
[null,null,null,null,null,null,null,null,null,{"$f":"IFERROR(VLOOKUP(D55,DadosMedições!$D$6:$O$75,3,FALSE),\"\")","v":""},{"$f":"IFERROR(VLOOKUP(D55,DadosMedições!$D$6:$O$75,5,FALSE),\"\")","v":""},{"$f":"IFERROR(VLOOKUP(D55,DadosMedições!$D$6:$O$75,10,FALSE),\"\")","v":""},{"$f":"IFERROR(VLOOKUP(D55,DadosMedições!$D$6:$O$75,11,FALSE),\"\")","v":""}]
[null,null,null,null,null,null,null,null,null,{"$f":"IFERROR(VLOOKUP(D56,DadosMedições!$D$6:$O$75,3,FALSE),\"\")","v":""},{"$f":"IFERROR(VLOOKUP(D56,DadosMedições!$D$6:$O$75,5,FALSE),\"\")","v":""},{"$f":"IFERROR(VLOOKUP(D56,DadosMedições!$D$6:$O$75,10,FALSE),\"\")","v":""},{"$f":"IFERROR(VLOOKUP(D56,DadosMedições!$D$6:$O$75,11,FALSE),\"\")","v":""}]
[null,null,null,null,null,null,null,null,null,{"$f":"IFERROR(VLOOKUP(D57,DadosMedições!$D$6:$O$75,3,FALSE),\"\")","v":""},{"$f":"IFERROR(VLOOKUP(D57,DadosMedições!$D$6:$O$75,5,FALSE),\"\")","v":""},{"$f":"IFERROR(VLOOKUP(D57,DadosMedições!$D$6:$O$75,10,FALSE),\"\")","v":""},{"$f":"IFERROR(VLOOKUP(D57,DadosMedições!$D$6:$O$75,11,FALSE),\"\")","v":""}]
[null,null,null,null,null,null,null,null,null,{"$f":"IFERROR(VLOOKUP(D58,DadosMedições!$D$6:$O$75,3,FALSE),\"\")","v":""},{"$f":"IFERROR(VLOOKUP(D58,DadosMedições!$D$6:$O$75,5,FALSE),\"\")","v":""},{"$f":"IFERROR(VLOOKUP(D58,DadosMedições!$D$6:$O$75,10,FALSE),\"\")","v":""},{"$f":"IFERROR(VLOOKUP(D58,DadosMedições!$D$6:$O$75,11,FALSE),\"\")","v":""}]
[]
[null,null,null,null,null,null,null,null,"Contagem ","Num",null,"DISJ BIF 50A"]
[null,null,null,null,null,null,null,null,{"$f":"L19&\"-\"&COUNTIF($L$19:L19,L19)","v":"DISJ MONOF  32A-1"},1,null,{"$f":"INDEX($D$19:$D$58,MATCH(\"DISJ BIF 50A-\"&J61,$I$61:$I$100,0))","v":{"$error":"#N/A"}}]
[null,null,null,null,null,null,null,null,{"$f":"L20&\"-\"&COUNTIF($L$19:L20,L20)","v":"DISJ TRIF  32A-1"},2,null,{"$f":"INDEX($D$19:$D$58,MATCH(\"DISJ BIF 50A-\"&J62,$I$61:$I$100,0))","v":{"$error":"#N/A"}}]
[null,null,null,null,null,null,null,null,{"$f":"L21&\"-\"&COUNTIF($L$19:L21,L21)","v":"DISJ TRIF  32A-2"},3,null,{"$error":"#N/A"}]
[null,null,null,null,null,null,null,null,{"$f":"L22&\"-\"&COUNTIF($L$19:L22,L22)","v":"DISJ MONOF  50A-1"},4,null,{"$error":"#N/A"}]
[null,null,null,null,null,null,null,null,{"$f":"L23&\"-\"&COUNTIF($L$19:L23,L23)","v":"DISJ MONOF  50A-2"},5,null,{"$error":"#N/A"}]
[null,null,null,null,null,null,null,null,{"$f":"L24&\"-\"&COUNTIF($L$19:L24,L24)","v":"DISJ MONOF  50A-3"},6,null,{"$error":"#N/A"}]
[null,null,null,null,null,null,null,null,{"$f":"L25&\"-\"&COUNTIF($L$19:L25,L25)","v":"DISJ MONOF  50A-4"},7,null,{"$error":"#N/A"}]
[null,null,null,null,null,null,null,null,{"$f":"L26&\"-\"&COUNTIF($L$19:L26,L26)","v":"DISJ MONOF  50A-5"},8,null,{"$error":"#N/A"}]
[null,null,null,null,null,null,null,null,{"$f":"L27&\"-\"&COUNTIF($L$19:L27,L27)","v":"DISJ MONOF  50A-6"},9,null,{"$error":"#N/A"}]
[null,null,null,null,null,null,null,null,{"$f":"L28&\"-\"&COUNTIF($L$19:L28,L28)","v":"DISJ MONOF  50A-7"},10,null,{"$error":"#N/A"}]
[null,null,null,null,null,null,null,null,{"$f":"L29&\"-\"&COUNTIF($L$19:L29,L29)","v":"DISJ MONOF  50A-8"},11,null,{"$error":"#N/A"}]
[null,null,null,null,null,null,null,null,{"$f":"L30&\"-\"&COUNTIF($L$19:L30,L30)","v":"DISJ MONOF  50A-9"},12,null,{"$error":"#N/A"}]
[null,null,null,null,null,null,null,null,{"$f":"L31&\"-\"&COUNTIF($L$19:L31,L31)","v":"DISJ MONOF  50A-10"},13,null,{"$error":"#N/A"}]
[null,null,null,null,null,null,null,null,{"$f":"L32&\"-\"&COUNTIF($L$19:L32,L32)","v":"-1"},14,null,{"$error":"#N/A"}]
[null,null,null,null,null,null,null,null,{"$f":"L33&\"-\"&COUNTIF($L$19:L33,L33)","v":"-2"},15,null,{"$error":"#N/A"}]
[null,null,null,null,null,null,null,null,{"$f":"L34&\"-\"&COUNTIF($L$19:L34,L34)","v":"-3"},16,null,{"$error":"#N/A"}]
[null,null,null,null,null,null,null,null,{"$f":"L35&\"-\"&COUNTIF($L$19:L35,L35)","v":"-4"},17,null,{"$error":"#N/A"}]
[null,null,null,null,null,null,null,null,{"$f":"L36&\"-\"&COUNTIF($L$19:L36,L36)","v":"-5"},18,null,{"$error":"#N/A"}]
[null,null,null,null,null,null,null,null,{"$f":"L37&\"-\"&COUNTIF($L$19:L37,L37)","v":"-6"},19,null,{"$error":"#N/A"}]
[null,null,null,null,null,null,null,null,{"$f":"L38&\"-\"&COUNTIF($L$19:L38,L38)","v":"-7"},20,null,{"$error":"#N/A"}]
[null,null,null,null,null,null,null,null,{"$f":"L39&\"-\"&COUNTIF($L$19:L39,L39)","v":"-8"},21,null,{"$error":"#N/A"}]
[null,null,null,null,null,null,null,null,{"$f":"L40&\"-\"&COUNTIF($L$19:L40,L40)","v":"-9"},22,null,{"$error":"#N/A"}]
[null,null,null,null,null,null,null,null,{"$f":"L41&\"-\"&COUNTIF($L$19:L41,L41)","v":"-10"},23,null,{"$error":"#N/A"}]
[null,null,null,null,null,null,null,null,{"$f":"L42&\"-\"&COUNTIF($L$19:L42,L42)","v":"-11"},24,null,{"$error":"#N/A"}]
[null,null,null,null,null,null,null,null,{"$f":"L43&\"-\"&COUNTIF($L$19:L43,L43)","v":"-12"},25,null,{"$error":"#N/A"}]
[null,null,null,null,null,null,null,null,{"$f":"L44&\"-\"&COUNTIF($L$19:L44,L44)","v":"-13"},26,null,{"$error":"#N/A"}]
[null,null,null,null,null,null,null,null,{"$f":"L45&\"-\"&COUNTIF($L$19:L45,L45)","v":"-14"},27,null,{"$error":"#N/A"}]
[null,null,null,null,null,null,null,null,{"$f":"L46&\"-\"&COUNTIF($L$19:L46,L46)","v":"-15"},28,null,{"$error":"#N/A"}]
[null,null,null,null,null,null,null,null,{"$f":"L47&\"-\"&COUNTIF($L$19:L47,L47)","v":"-16"},29,null,{"$error":"#N/A"}]
[null,null,null,null,null,null,null,null,{"$f":"L48&\"-\"&COUNTIF($L$19:L48,L48)","v":"-17"},30,null,{"$error":"#N/A"}]
[null,null,null,null,null,null,null,null,{"$f":"L49&\"-\"&COUNTIF($L$19:L49,L49)","v":"-18"},31,null,{"$error":"#N/A"}]
[null,null,null,null,null,null,null,null,{"$f":"L50&\"-\"&COUNTIF($L$19:L50,L50)","v":"-19"},32,null,{"$error":"#N/A"}]
[null,null,null,null,null,null,null,null,{"$f":"L51&\"-\"&COUNTIF($L$19:L51,L51)","v":"-20"},33,null,{"$error":"#N/A"}]
[null,null,null,null,null,null,null,null,{"$f":"L52&\"-\"&COUNTIF($L$19:L52,L52)","v":"-21"},34,null,{"$error":"#N/A"}]
[null,null,null,null,null,null,null,null,{"$f":"L53&\"-\"&COUNTIF($L$19:L53,L53)","v":"-22"},35,null,{"$error":"#N/A"}]
[null,null,null,null,null,null,null,null,{"$f":"L54&\"-\"&COUNTIF($L$19:L54,L54)","v":"-23"},36,null,{"$error":"#N/A"}]
[null,null,null,null,null,null,null,null,{"$f":"L55&\"-\"&COUNTIF($L$19:L55,L55)","v":"-24"},37,null,{"$error":"#N/A"}]
[null,null,null,null,null,null,null,null,{"$f":"L56&\"-\"&COUNTIF($L$19:L56,L56)","v":"-25"},38,null,{"$error":"#N/A"}]
[null,null,null,null,null,null,null,null,{"$f":"L57&\"-\"&COUNTIF($L$19:L57,L57)","v":"-26"},39,null,{"$error":"#N/A"}]
[null,null,null,null,null,null,null,null,{"$f":"L58&\"-\"&COUNTIF($L$19:L58,L58)","v":"-27"},40,null,{"$error":"#N/A"}]
[]
[]
[]
[null,null,null,{"$f":"SUM(J19:J58)/1000","v":95.89}]

{"sheet":"Ramal_Aerero_Poste de transição","index":10,"n_rows":124,"n_cols":94,"rows_kept":124,"cut":false,"hidden":false,"merged":[[38,85,40,87],[47,85,51,87],[127,1,134,82],[123,1,126,82],[85,57,87,57],[88,1,91,82],[14,85,17,86],[33,85,37,86],[7,85,10,86],[21,85,24,86],[30,85,32,87],[1,1,1,82],[2,1,3,82],[5,36,5,53],[5,24,5,35],[1,84,1,90],[2,84,2,90]]}
[]
[null,"Painel Coletivo  - Interligação Neoenergia Brasília ",null,null,null,null,null,null,null,null,null,null,null,null,null,null,null,null,null,null,null,null,null,null,null,null,null,null,null,null,null,null,null,null,null,null,null,null,null,null,null,null,null,null,null,null,null,null,null,null,null,null,null,null,null,null,null,null,null,null,null,null,null,null,null,null,null,null,null,null,null,null,null,null,null,null,null,null,null,null,null,null,null,null,"LEGENDA "]
[null,"PLANTA SITUAÇÃO/LOCALIZAÇÃO",null,null,null,null,null,null,null,null,null,null,null,null,null,null,null,null,null,null,null,null,null,null,null,null,null,null,null,null,null,null,null,null,null,null,null,null,null,null,null,null,null,null,null,null,null,null,null,null,null,null,null,null,null,null,null,null,null,null,null,null,null,null,null,null,null,null,null,null,null,null,null,null,null,null,null,null,null,null,null,null,null,null,"Posicione os itens na planta de situação"]
[]
[]
[null,null,null,null,null,null,null,null,null,null,null,null,null,null,null,null,null,null,null,null,null,null,null,null,"TIPO DE TERRENO: ",null,null,null,null,null,null,null,null,null,null,null,"Meio",null,null,null,null,null,null,null,null,null,null,null,null,null,null,null,null,null,null,null,null,null,null,null,null,null,null,null,null,null,null,null,null,null,null,null,null,null,null,null,null,null,null,null,null,null,null,null,null,"CAIXA CB1"]
[]
[null,null,null,null,null,null,null,null,null,null,null,null,null,null,null,null,null,null,null,null,null,null,null,null,null,null,null,null,null,null,null,null,null,null,null,null,null,null,null,null,null,null,null,null,null,null,null,null,null,null,null,null,null,null,null,null,null,null,null,null,null,null,null,null,null,null,null,null,null,null,null,null,null,null,null,null,null,null,null,null,null,null,null,null,null,"CAIXA CB2"]
[]
[]
[]
[]
[]
[]
[null,null,null,null,null,null,null,null,null,null,null,null,null,null,null,null,null,null,null,null,null,null,null,null,null,null,null,null,null,null,null,null,null,null,null,null,null,null,null,null,null,null,null,null,null,null,null,null,null,null,null,null,null,null,null,null,null,null,null,null,null,null,null,null,null,null,null,null,null,null,null,null,null,null,null,null,null,null,null,null,null,null,null,null,null,"POSTE PARTICULAR"]
[]
[]
[]
[]
[]
[]
[null,null,null,null,null,null,null,null,null,null,null,null,null,null,null,null,null,null,null,null,null,null,null,null,null,null,null,null,null,null,null,null,null,null,null,null,null,null,null,null,null,null,null,null,null,null,null,null,null,null,null,null,null,null,null,null,null,null,null,null,null,null,null,null,null,null,null,null,null,null,null,null,null,null,null,null,null,null,null,null,null,null,null,null,null,"POSTE DE REDE "]
[]
[]
[]
[null,null,null,null,null,null,null,null,null,null,null,null,null,null,null,null,null,null,null,null,null,null,null,null,null,null,null,null,null,null,null,null,null,null,null,null,null,null,null,null,null,null,null,null,null,null,null,null,null,null,null,null,null,null,null,null,null,null,null,null,null,null,null,null,null,null,null,null,null,null,null,null,null,null,null,null,null,null,null,null,null,null,null,null,null,null,null,null,null,null,null,null,null,"Di"]
[]
[]
[]
[]
[null,null,null,null,null,null,null,null,null,null,null,null,null,null,null,null,null,null,null,null,null,null,null,null,null,null,null,null,null,null,null,null,null,null,null,null,null,null,null,null,null,null,null,null,null,null,null,null,null,null,null,null,null,null,null,null,null,null,null,null,null,null,null,null,null,null,null,null,null,null,null,null,null,null,null,null,null,null,null,null,null,null,null,null,null,"PAINEL DE MEDIÇÃO "]
[]
[]
[]
[]
[]
[]
[]
[null,null,null,null,null,null,null,null,null,null,null,null,null,null,null,null,null,null,null,null,null,null,null,null,null,null,null,null,null,null,null,null,null,null,null,null,null,null,null,null,null,null,null,null,null,null,null,null,null,null,null,null,null,null,null,null,null,null,null,null,null,null,null,null,null,null,null,null,null,null,null,null,null,null,null,null,null,null,null,null,null,null,null,null,null,"   REDE ELÉTRICA "]
[]
[]
[]
[]
[]
[]
[]
[]
[]
[]
[]
[]
[]
[]
[]
[]
[]
[]
[]
[]
[]
[]
[]
[]
[]
[]
[]
[]
[]
[]
[]
[]
[]
[]
[]
[]
[]
[]
[]
[]
[]
[]
[]
[]
[]
[]
[]
[]
[]
[null,"TIPO DE DERIVAÇÃO DA REDE "]
[]
[]
[]
[]
[]
[]
[]
[]
[]
[]
[]
[]
[]
[]
[]
[]
[]
[]
[]
[]
[]
[]
[]
[]
[]
[]
[]
[]
[]
[]
[]
[]
[]
[]
[null,"OBSERVAÇÕES DO PROJETISTA:"]

{"sheet":"Ramal","index":11,"n_rows":27,"n_cols":7,"rows_kept":27,"cut":false,"hidden":false,"merged":[[1,1,2,3],[6,1,6,4],[6,5,6,6],[8,1,8,4],[10,1,10,4],[10,5,10,6],[1,4,2,9],[3,1,4,9],[12,1,12,4],[12,5,12,6],[26,1,26,4],[26,5,26,6],[14,1,15,4],[14,5,15,6],[17,1,17,4],[17,5,17,6],[19,1,19,4],[19,5,19,6],[21,1,21,4],[21,5,21,6],[23,1,24,4],[23,5,24,6]]}
[]
[null,null,null,null,"Painel Coletivo - Interligação Neoenergia Brasília"]
[]
[null,"Parâmetros  para dimensionamento do Ramal de Entrada"]
[]
[]
[null,"Tensão Primário/Secundário (kV):",null,null,null,"0,38kV"]
[]
[null,"Carga instalada",null,null,null,{"$f":"Medições!D104","v":95.89},"kW"]
[]
[null,"Fator de demanda ",null,null,null,0.38]
[]
[null,"Disjuntor",null,null,null,63]
[]
[null,"Tipo de Isolação do  condutor dor ramal de entrada (BT)",null,null,null,"EPR/XLPE 90ºC (mm²)"]
[]
[]
[null,"Condutores:",null,null,null,"3#16(16)T#16"]
[]
[null,"Rede de Fornecimento",null,null,null,"Aérea"]
[]
[null,"Tipo Ramal",null,null,null,"Subterrâneo"]
[]
[null,"Ramal de ligação cruzará  a rua ou  sómente a calçada?",null,null,null,"Cruzará somente a calçada"]
[]
[]
[null,"Tipo de transição ",null,null,null,"Poste da rede"]

{"sheet":"Ramal_subterraneo_redesub","index":12,"n_rows":124,"n_cols":94,"rows_kept":124,"cut":false,"hidden":false,"merged":[[47,85,51,87],[85,57,87,57],[88,1,91,82],[123,1,126,82],[127,1,134,82],[38,85,40,87],[1,1,1,82],[1,84,1,90],[2,1,3,82],[2,84,2,90],[5,24,5,35],[5,36,5,53],[7,85,10,86],[14,85,17,86],[21,85,24,86],[30,85,32,87],[33,85,37,86]]}
[]
[null,"Painel Coletivo  - Interligação Neoenergia Brasília ",null,null,null,null,null,null,null,null,null,null,null,null,null,null,null,null,null,null,null,null,null,null,null,null,null,null,null,null,null,null,null,null,null,null,null,null,null,null,null,null,null,null,null,null,null,null,null,null,null,null,null,null,null,null,null,null,null,null,null,null,null,null,null,null,null,null,null,null,null,null,null,null,null,null,null,null,null,null,null,null,null,null,"LEGENDA "]
[null,"PLANTA SITUAÇÃO/LOCALIZAÇÃO",null,null,null,null,null,null,null,null,null,null,null,null,null,null,null,null,null,null,null,null,null,null,null,null,null,null,null,null,null,null,null,null,null,null,null,null,null,null,null,null,null,null,null,null,null,null,null,null,null,null,null,null,null,null,null,null,null,null,null,null,null,null,null,null,null,null,null,null,null,null,null,null,null,null,null,null,null,null,null,null,null,null,"Posicione os itens na planta de situação"]
[]
[]
[null,null,null,null,null,null,null,null,null,null,null,null,null,null,null,null,null,null,null,null,null,null,null,null,"TIPO DE TERRENO: ",null,null,null,null,null,null,null,null,null,null,null,"Quarteirão",null,null,null,null,null,null,null,null,null,null,null,null,null,null,null,null,null,null,null,null,null,null,null,null,null,null,null,null,null,null,null,null,null,null,null,null,null,null,null,null,null,null,null,null,null,null,null,null,"CAIXA CB1"]
[]
[null,null,null,null,null,null,null,null,null,null,null,null,null,null,null,null,null,null,null,null,null,null,null,null,null,null,null,null,null,null,null,null,null,null,null,null,null,null,null,null,null,null,null,null,null,null,null,null,null,null,null,null,null,null,null,null,null,null,null,null,null,null,null,null,null,null,null,null,null,null,null,null,null,null,null,null,null,null,null,null,null,null,null,null,null,"CAIXA CB2"]
[]
[]
[]
[]
[]
[]
[null,null,null,null,null,null,null,null,null,null,null,null,null,null,null,null,null,null,null,null,null,null,null,null,null,null,null,null,null,null,null,null,null,null,null,null,null,null,null,null,null,null,null,null,null,null,null,null,null,null,null,null,null,null,null,null,null,null,null,null,null,null,null,null,null,null,null,null,null,null,null,null,null,null,null,null,null,null,null,null,null,null,null,null,null,"POSTE PARTICULAR"]
[]
[]
[]
[]
[]
[]
[null,null,null,null,null,null,null,null,null,null,null,null,null,null,null,null,null,null,null,null,null,null,null,null,null,null,null,null,null,null,null,null,null,null,null,null,null,null,null,null,null,null,null,null,null,null,null,null,null,null,null,null,null,null,null,null,null,null,null,null,null,null,null,null,null,null,null,null,null,null,null,null,null,null,null,null,null,null,null,null,null,null,null,null,null,"POSTE DE REDE "]
[]
[]
[]
[null,null,null,null,null,null,null,null,null,null,null,null,null,null,null,null,null,null,null,null,null,null,null,null,null,null,null,null,null,null,null,null,null,null,null,null,null,null,null,null,null,null,null,null,null,null,null,null,null,null,null,null,null,null,null,null,null,null,null,null,null,null,null,null,null,null,null,null,null,null,null,null,null,null,null,null,null,null,null,null,null,null,null,null,null,null,null,null,null,null,null,null,null,"Di"]
[]
[]
[]
[]
[null,null,null,null,null,null,null,null,null,null,null,null,null,null,null,null,null,null,null,null,null,null,null,null,null,null,null,null,null,null,null,null,null,null,null,null,null,null,null,null,null,null,null,null,null,null,null,null,null,null,null,null,null,null,null,null,null,null,null,null,null,null,null,null,null,null,null,null,null,null,null,null,null,null,null,null,null,null,null,null,null,null,null,null,null,"PAINEL DE MEDIÇÃO "]
[]
[]
[]
[]
[]
[]
[]
[null,null,null,null,null,null,null,null,null,null,null,null,null,null,null,null,null,null,null,null,null,null,null,null,null,null,null,null,null,null,null,null,null,null,null,null,null,null,null,null,null,null,null,null,null,null,null,null,null,null,null,null,null,null,null,null,null,null,null,null,null,null,null,null,null,null,null,null,null,null,null,null,null,null,null,null,null,null,null,null,null,null,null,null,null,"   REDE ELÉTRICA "]
[]
[]
[]
[]
[]
[]
[]
[]
[]
[]
[]
[]
[]
[]
[]
[]
[]
[]
[]
[]
[]
[]
[]
[]
[]
[]
[]
[]
[]
[]
[]
[]
[]
[]
[]
[]
[]
[]
[]
[]
[]
[]
[]
[]
[]
[]
[]
[]
[]
[null,"TIPO DE DERIVAÇÃO DA REDE "]
[]
[]
[]
[]
[]
[]
[]
[]
[]
[]
[]
[]
[]
[]
[]
[]
[]
[]
[]
[]
[]
[]
[]
[]
[]
[]
[]
[]
[]
[]
[]
[]
[]
[]
[null,"OBSERVAÇÕES DO PROJETISTA:"]

{"sheet":"Ramal_subterraneo_posterede","index":13,"n_rows":124,"n_cols":86,"rows_kept":124,"cut":false,"hidden":false,"merged":[[47,85,51,87],[85,57,87,57],[88,1,91,82],[123,1,126,82],[127,1,134,82],[38,85,40,87],[1,1,1,82],[1,84,1,90],[2,1,3,82],[2,84,2,90],[5,24,5,35],[5,36,5,53],[7,85,10,86],[14,85,17,86],[21,85,24,86],[30,85,32,87],[33,85,37,86]]}
[]
[null,"Painel Coletivo  - Interligação Neoenergia Brasília ",null,null,null,null,null,null,null,null,null,null,null,null,null,null,null,null,null,null,null,null,null,null,null,null,null,null,null,null,null,null,null,null,null,null,null,null,null,null,null,null,null,null,null,null,null,null,null,null,null,null,null,null,null,null,null,null,null,null,null,null,null,null,null,null,null,null,null,null,null,null,null,null,null,null,null,null,null,null,null,null,null,null,"LEGENDA "]
[null,"PLANTA SITUAÇÃO/LOCALIZAÇÃO",null,null,null,null,null,null,null,null,null,null,null,null,null,null,null,null,null,null,null,null,null,null,null,null,null,null,null,null,null,null,null,null,null,null,null,null,null,null,null,null,null,null,null,null,null,null,null,null,null,null,null,null,null,null,null,null,null,null,null,null,null,null,null,null,null,null,null,null,null,null,null,null,null,null,null,null,null,null,null,null,null,null,"Posicione os itens na planta de situação"]
[]
[]
[null,null,null,null,null,null,null,null,null,null,null,null,null,null,null,null,null,null,null,null,null,null,null,null,"TIPO DE TERRENO: ",null,null,null,null,null,null,null,null,null,null,null,"Quarteirão",null,null,null,null,null,null,null,null,null,null,null,null,null,null,null,null,null,null,null,null,null,null,null,null,null,null,null,null,null,null,null,null,null,null,null,null,null,null,null,null,null,null,null,null,null,null,null,null,"CAIXA CB1"]
[]
[null,null,null,null,null,null,null,null,null,null,null,null,null,null,null,null,null,null,null,null,null,null,null,null,null,null,null,null,null,null,null,null,null,null,null,null,null,null,null,null,null,null,null,null,null,null,null,null,null,null,null,null,null,null,null,null,null,null,null,null,null,null,null,null,null,null,null,null,null,null,null,null,null,null,null,null,null,null,null,null,null,null,null,null,null,"CAIXA CB2"]
[]
[]
[]
[]
[]
[]
[null,null,null,null,null,null,null,null,null,null,null,null,null,null,null,null,null,null,null,null,null,null,null,null,null,null,null,null,null,null,null,null,null,null,null,null,null,null,null,null,null,null,null,null,null,null,null,null,null,null,null,null,null,null,null,null,null,null,null,null,null,null,null,null,null,null,null,null,null,null,null,null,null,null,null,null,null,null,null,null,null,null,null,null,null,"POSTE PARTICULAR"]
[]
[]
[]
[]
[]
[]
[null,null,null,null,null,null,null,null,null,null,null,null,null,null,null,null,null,null,null,null,null,null,null,null,null,null,null,null,null,null,null,null,null,null,null,null,null,null,null,null,null,null,null,null,null,null,null,null,null,null,null,null,null,null,null,null,null,null,null,null,null,null,null,null,null,null,null,null,null,null,null,null,null,null,null,null,null,null,null,null,null,null,null,null,null,"POSTE DE REDE "]
[]
[]
[]
[]
[]
[]
[]
[]
[null,null,null,null,null,null,null,null,null,null,null,null,null,null,null,null,null,null,null,null,null,null,null,null,null,null,null,null,null,null,null,null,null,null,null,null,null,null,null,null,null,null,null,null,null,null,null,null,null,null,null,null,null,null,null,null,null,null,null,null,null,null,null,null,null,null,null,null,null,null,null,null,null,null,null,null,null,null,null,null,null,null,null,null,null,"PAINEL DE MEDIÇÃO "]
[]
[]
[]
[]
[]
[]
[]
[null,null,null,null,null,null,null,null,null,null,null,null,null,null,null,null,null,null,null,null,null,null,null,null,null,null,null,null,null,null,null,null,null,null,null,null,null,null,null,null,null,null,null,null,null,null,null,null,null,null,null,null,null,null,null,null,null,null,null,null,null,null,null,null,null,null,null,null,null,null,null,null,null,null,null,null,null,null,null,null,null,null,null,null,null,"   REDE ELÉTRICA "]
[]
[]
[]
[]
[]
[]
[]
[]
[]
[]
[]
[]
[]
[]
[]
[]
[]
[]
[]
[]
[]
[]
[]
[]
[]
[]
[]
[]
[]
[]
[]
[]
[]
[]
[]
[]
[]
[]
[]
[]
[]
[]
[]
[]
[]
[]
[]
[]
[]
[null,"TIPO DE DERIVAÇÃO DA REDE "]
[]
[]
[]
[]
[]
[]
[]
[]
[]
[]
[]
[]
[]
[]
[]
[]
[]
[]
[]
[]
[]
[]
[]
[]
[]
[]
[]
[]
[]
[]
[]
[]
[]
[]
[null,"OBSERVAÇÕES DO PROJETISTA:"]

{"sheet":"Rede_aerea_pontalete","index":14,"n_rows":124,"n_cols":94,"rows_kept":124,"cut":false,"hidden":false,"merged":[[47,85,51,87],[85,57,87,57],[88,1,91,82],[123,1,126,82],[127,1,134,82],[38,85,40,87],[1,1,1,82],[1,84,1,90],[2,1,3,82],[2,84,2,90],[5,24,5,35],[5,36,5,53],[7,85,10,86],[14,85,17,86],[21,85,24,86],[30,85,32,87],[33,85,37,86]]}
[]
[null,"Painel Coletivo  - Interligação Neoenergia Brasília ",null,null,null,null,null,null,null,null,null,null,null,null,null,null,null,null,null,null,null,null,null,null,null,null,null,null,null,null,null,null,null,null,null,null,null,null,null,null,null,null,null,null,null,null,null,null,null,null,null,null,null,null,null,null,null,null,null,null,null,null,null,null,null,null,null,null,null,null,null,null,null,null,null,null,null,null,null,null,null,null,null,null,"LEGENDA "]
[null,"PLANTA SITUAÇÃO/LOCALIZAÇÃO",null,null,null,null,null,null,null,null,null,null,null,null,null,null,null,null,null,null,null,null,null,null,null,null,null,null,null,null,null,null,null,null,null,null,null,null,null,null,null,null,null,null,null,null,null,null,null,null,null,null,null,null,null,null,null,null,null,null,null,null,null,null,null,null,null,null,null,null,null,null,null,null,null,null,null,null,null,null,null,null,null,null,"Posicione os itens na planta de situação"]
[]
[]
[null,null,null,null,null,null,null,null,null,null,null,null,null,null,null,null,null,null,null,null,null,null,null,null,"TIPO DE TERRENO: ",null,null,null,null,null,null,null,null,null,null,null,"Quarteirão",null,null,null,null,null,null,null,null,null,null,null,null,null,null,null,null,null,null,null,null,null,null,null,null,null,null,null,null,null,null,null,null,null,null,null,null,null,null,null,null,null,null,null,null,null,null,null,null,"CAIXA CB1"]
[]
[null,null,null,null,null,null,null,null,null,null,null,null,null,null,null,null,null,null,null,null,null,null,null,null,null,null,null,null,null,null,null,null,null,null,null,null,null,null,null,null,null,null,null,null,null,null,null,null,null,null,null,null,null,null,null,null,null,null,null,null,null,null,null,null,null,null,null,null,null,null,null,null,null,null,null,null,null,null,null,null,null,null,null,null,null,"CAIXA CB2"]
[]
[]
[]
[]
[]
[]
[null,null,null,null,null,null,null,null,null,null,null,null,null,null,null,null,null,null,null,null,null,null,null,null,null,null,null,null,null,null,null,null,null,null,null,null,null,null,null,null,null,null,null,null,null,null,null,null,null,null,null,null,null,null,null,null,null,null,null,null,null,null,null,null,null,null,null,null,null,null,null,null,null,null,null,null,null,null,null,null,null,null,null,null,null,"POSTE PARTICULAR"]
[]
[]
[]
[]
[]
[]
[null,null,null,null,null,null,null,null,null,null,null,null,null,null,null,null,null,null,null,null,null,null,null,null,null,null,null,null,null,null,null,null,null,null,null,null,null,null,null,null,null,null,null,null,null,null,null,null,null,null,null,null,null,null,null,null,null,null,null,null,null,null,null,null,null,null,null,null,null,null,null,null,null,null,null,null,null,null,null,null,null,null,null,null,null,"POSTE DE REDE "]
[]
[]
[]
[null,null,null,null,null,null,null,null,null,null,null,null,null,null,null,null,null,null,null,null,null,null,null,null,null,null,null,null,null,null,null,null,null,null,null,null,null,null,null,null,null,null,null,null,null,null,null,null,null,null,null,null,null,null,null,null,null,null,null,null,null,null,null,null,null,null,null,null,null,null,null,null,null,null,null,null,null,null,null,null,null,null,null,null,null,null,null,null,null,null,null,null,null,"Di"]
[]
[]
[]
[]
[null,null,null,null,null,null,null,null,null,null,null,null,null,null,null,null,null,null,null,null,null,null,null,null,null,null,null,null,null,null,null,null,null,null,null,null,null,null,null,null,null,null,null,null,null,null,null,null,null,null,null,null,null,null,null,null,null,null,null,null,null,null,null,null,null,null,null,null,null,null,null,null,null,null,null,null,null,null,null,null,null,null,null,null,null,"PAINEL DE MEDIÇÃO "]
[]
[]
[]
[]
[]
[]
[]
[null,null,null,null,null,null,null,null,null,null,null,null,null,null,null,null,null,null,null,null,null,null,null,null,null,null,null,null,null,null,null,null,null,null,null,null,null,null,null,null,null,null,null,null,null,null,null,null,null,null,null,null,null,null,null,null,null,null,null,null,null,null,null,null,null,null,null,null,null,null,null,null,null,null,null,null,null,null,null,null,null,null,null,null,null,"   REDE ELÉTRICA "]
[]
[]
[]
[]
[]
[]
[]
[]
[]
[]
[]
[]
[]
[]
[]
[]
[]
[]
[]
[]
[]
[]
[]
[]
[]
[]
[]
[]
[]
[]
[]
[]
[]
[]
[]
[]
[]
[]
[]
[]
[]
[]
[]
[]
[]
[]
[]
[]
[]
[null,"TIPO DE DERIVAÇÃO DA REDE "]
[]
[]
[]
[]
[]
[]
[]
[]
[]
[]
[]
[]
[]
[]
[]
[]
[]
[]
[]
[]
[]
[]
[]
[]
[]
[]
[]
[]
[]
[]
[]
[]
[]
[]
[null,"OBSERVAÇÕES DO PROJETISTA:"]

{"sheet":"Diagrama","index":15,"n_rows":60,"n_cols":32,"rows_kept":60,"cut":false,"hidden":false,"merged":[[6,23,7,25],[13,12,13,16],[1,1,1,15],[27,27,28,30],[31,27,32,30],[2,1,3,39],[1,16,1,39],[10,28,10,32],[7,31,7,38],[17,31,18,38],[32,31,33,38],[29,31,30,38],[38,31,39,38],[25,31,26,38],[21,31,22,38],[40,4,42,9],[15,27,16,30],[19,27,20,30],[23,27,24,30],[37,27,38,30],[34,27,35,30],[19,12,23,14],[25,12,29,13],[35,31,36,38]]}
[]
[null,null,null,null,null,null,null,null,null,null,null,null,null,null,null,null,"Painel Coletivo - Interligação Neoenergia Brasília"]
[null,"DIAGRAMA UNIFILAR"]
[]
[]
[null,null,null,null,null,null,null,null,null,null,null,null,null,null,null,null,null,null,null,null,null,null,null,{"$f":"CONCATENATE(QDINC!E29,\"A\")","v":"32A"}]
[null,null,null,null,null,null,null,null,null,null,null,null,null,null,null,null,null,null,null,null,null,null,null,null,null,null,null,null,null,{"$f":"IF(Formulário!H16=\"Sim\",\"POSSUI MEDIÇÃO DE INCÊNDIO\",\"SEM MEDIÇÃO DE INCÊNDIO\")","v":"POSSUI MEDIÇÃO DE INCÊNDIO"}]
[]
[null,null,null,null,null,null,null,null,null,null,null,null,null,null,null,null,null,null,null,null,null,null,null,null,null,null,null,{"$f":"QDINC!E30","v":"3#6(6)T#6"}]
[]
[]
[]
[null,null,null,null,{"$f":"Ramal!F18","v":"3#16(16)T#16"}]
[null,null,null,null,{"$f":"Ramal!F15","v":"EPR/XLPE 90ºC (mm²)"},null,null,null,null,null,null,null,{"$f":"_xlfn.CONCAT(\"DISJ TRIF \",Ramal!F13,\"A\")","v":"DISJ TRIF 63A"}]
[]
[null,null,null,null,null,null,null,null,null,null,null,null,null,null,null,null,null,null,null,null,null,null,"32A/35A",null,null,null,null,"1#6(6)T#6"]
[]
[null,null,null,null,null,null,null,null,null,null,null,null,null,null,null,null,null,null,null,null,null,null,null,null,null,null,null,null,null,null,null,{"$f":"CONCATENATE((Tabelas!U10),\" MEDIÇÕES MONOFÁSICAS DE 32A/35A\")","v":"1 MEDIÇÕES MONOFÁSICAS DE 32A/35A"}]
[]
[null,null,null,null,null,null,null,null,null,null,null,null,"3 DISJ \nMON 20A",null,null,null,null,null,null,null,null,null,"50A",null,null,null,null,"1#10(10)T#10"]
[]
[null,null,null,null,null,null,null,null,null,null,null,null,null,null,null,null,null,null,null,null,null,null,null,null,null,null,null,null,null,null,null,{"$f":"CONCATENATE(COUNTIF(Medições!L19:L58, \"DISJ MONOF  50A\"),\" MEDIÇÕES MONOFÁSICAS DE 50A\")","v":"10 MEDIÇÕES MONOFÁSICAS DE 50A"}]
[]
[null,null,null,null,null,null,null,null,null,null,null,null,null,null,null,null,null,null,null,null,null,null,"32A/35A",null,null,null,null,"2#6(6)T#6"]
[]
[null,null,null,null,null,null,null,null,null,null,null,null,"DPS \nMIN 242V\n5KA",null,null,null,null,null,null,null,null,null,null,null,null,null,null,null,null,null,null,{"$f":"CONCATENATE(Tabelas!U13,\" MEDIÇÕES BIF DE 32A/35A\")","v":"0 MEDIÇÕES BIF DE 32A/35A"}]
[]
[null,null,null,null,null,null,null,null,null,null,null,null,null,null,null,null,null,null,null,null,null,null,"50A",null,null,null,null,"2#10(10)T#10"]
[]
[null,null,null,null,null,null,null,null,null,null,null,null,null,null,null,null,null,null,null,null,null,null,null,null,null,null,null,null,null,null,null,{"$f":"CONCATENATE(COUNTIF(Medições!L19:L58, \"DISJ BIF  50A\"),\" MEDIÇÕES BIFÁSICAS DE 50A\")","v":"0 MEDIÇÕES BIFÁSICAS DE 50A"}]
[]
[null,null,null,null,null,null,null,null,null,null,null,null,null,null,null,null,null,null,null,null,null,null,"32A/35A",null,null,null,null,"3#6(6)T#6"]
[null,null,null,null,null,null,null,null,null,null,null,null,null,null,null,null,null,null,null,null,null,null,null,null,null,null,null,null,null,null,null,{"$f":"CONCATENATE(Tabelas!U11,\" MEDIÇÕES TRIFÁSICAS DE 32A/35A\")","v":"2 MEDIÇÕES TRIFÁSICAS DE 32A/35A"}]
[]
[null,null,null,null,null,null,null,null,null,null,null,null,null,null,null,null,null,null,null,null,null,null,"50A",null,null,null,null,"3#10(10)T#10"]
[null,null,null,null,null,null,null,null,null,null,null,null,null,null,null,null,null,null,null,null,null,null,null,null,null,null,null,null,null,null,null,{"$f":"CONCATENATE(COUNTIF(Medições!L19:L58, \"DISJ TRIF  50A\"),\" MEDIÇÕES TRIFÁSICAS DE 50A\")","v":"0 MEDIÇÕES TRIFÁSICAS DE 50A"}]
[]
[null,null,null,null,null,null,null,null,null,null,null,null,null,null,null,null,null,null,null,null,null,null,"63A/70A/80A",null,null,null,null,"3#25(25)T#16"]
[null,null,null,null,null,null,null,null,null,null,null,null,null,null,null,null,null,null,null,null,null,null,null,null,null,null,null,null,null,null,null,{"$f":"CONCATENATE(Tabelas!U12,\" MEDIÇÕES TRIFÁSICAS DE 63A/70A/80A\")","v":"0 MEDIÇÕES TRIFÁSICAS DE 63A/70A/80A"}]
[]
[null,null,null,null,"VAI À MALHA DE \nATERRAMENTO"]
[]
[]
[]
[]
[]
[]
[]
[]
[]
[]
[]
[]
[]
[]
[]
[]
[]
[]
[null,null,{"$f":"CONCATENATE(QDINC!E29,\"A\")","v":"32A"}]

{"sheet":"Tabelas","index":16,"n_rows":41,"n_cols":26,"rows_kept":41,"cut":false,"hidden":true,"merged":[[31,0,31,8],[28,19,28,21],[13,19,13,20],[8,19,8,27],[11,0,11,8],[20,0,20,8],[23,0,23,8]]}
[null,null,"Tabelas de medições mono e bifáfico"]
["TIPO","FASE","Carga instalada","cabo","disjuntor 1","disjuntor 2"]
["M1","MONOF ",8,"1#6(6)T#6",32,35]
["M2","MONOF ",11,"1#10(10)T#10",40,50]
["B1","BIF ",15,"2#6(6)T#6",32,35]
["B2","BIF ",22,"2#10(10)T#10",40,50]
["T1","TRIF ",23,"3#6(6)T#6",32,35]
["T2","TRIF ",33,"3#10(10)T#10",40,50]
["T3","TRIF ",45,"3#25(25)T#16",63,70,80,null,null,null,null,null,null,null,null,null,null,null,null,"CONTAGEM MEDIÇÃO COM MAIS DE UMA OPÇÃO DE DISJUNTOR "]
["T4","TRIF ",65,"3#35(35)T#16",100,null,null,null,null,null,null,null,null,null,null,null,null,null,null,"MONO ",{"$f":"SUM(COUNTIFS(Medições!L19:L58,{\"DISJ MONOF  35A\";\"DISJ MONOF  32A\"}))","v":1}]
[null,null,null,null,null,null,null,null,null,null,null,null,null,null,null,null,null,null,null,"TRIF",{"$f":"SUM(COUNTIFS(Medições!L19:L58,{\"DISJ TRIF  35A\";\"DISJ TRIF  32A\"}))","v":2}]
["Tipos de painel de madeira",null,null,null,null,null,null,null,null,null,null,null,null,null,null,null,null,null,null,"TRIF2",{"$f":"SUM(COUNTIFS(Medições!L19:L58,{\"DISJ TRIF  63A\";\"DISJ TRIF  70A\";\"DISJ TRIF  80A\"}))","v":0}]
["M1","M2","B1","B2","T1","T2","T3","T4","Policarbonato",null,null,null,null,null,null,null,null,null,null,"BIF ",{"$f":"SUM(COUNTIFS(Medições!L19:L58,{\"DISJ BIF  32A\";\"DISJ BIF  35A\"}))","v":0}]
["A","A","B","B","B","B","C","C","Policarbonato",null,null,null,null,null,null,null,null,null,null,"SE´s Disjuntores "]
["B","B","C","C","C","C",null,null,null,null,null,null,null,null,null,null,null,null,null,{"$f":"IF(Tabelas!$A$26<=33, S33,IF(Tabelas!$A$26<=45, S34,IF(Tabelas!$A$26<=65, S35,IF(Tabelas!$A$26<=82, S36,IF(Tabelas!$A$26<=98,S37,IF(Tabelas!$A$26<=115,S38,IF(Tabelas!$A$26<=130,S39,IF(Tabelas!$A$26<=160,S40,IF(Tabelas!$A$26<=190,S41,\"\")))))))))","v":"T3"}]
["C","C"]
[32,40,32,40,32,40,63,100]
[35,50,35,50,35,50,70]
[null,null,null,null,null,null,80]
[]
["REGRA CAIXA DF "]
[{"$f":"IF(Medições!J8 = 12,13,\"\")","v":""},null,{"$f":"IF(Medições!J8 = 36,37,\"\")","v":""},{"$f":"IF(Medições!J8 = 48,49,\"\")","v":""}]
[{"$f":"IF(Medições!J9= \"DF-12\",12,\"\")","v":""},null,{"$f":"IF(Medições!J9= \"DF-36\",36,\"\")","v":""},{"$f":"IF(Medições!J9= \"DF-48\",48,\"\")","v":""}]
["REGRA DISJUNTOR "]
["DEMANDA  "]
[{"$f":"Ramal!F9*Ramal!F11","v":36.438200000000002}]
[]
["TE1"]
["TE2",null,null,null,null,null,null,null,null,null,null,null,null,null,null,null,null,null,"TIPO ","DISJUNTOR",null,null,"CONDUTOR UNIPOLAR","CONDUTOR UNIPOLAR","Disjuntores possíveis ","Cabos possíveis "]
["TE3",null,null,null,null,null,null,null,null,null,null,null,null,null,null,null,null,null,null,null,null,null,"Isolação XLPE/EPR 90 °C","Isolação PVC 70 °C"]
["TE4",null,null,null,null,null,null,null,null,null,null,null,null,null,null,null,null,null,null,null,null,null,"FASE/Neutro/Terra","FASE/Neutro/Terra",{"$f":"VLOOKUP(T15,S29:X41,2,FALSE)","v":63},{"$f":"IF(Ramal!F15=\"PVC 70º.C (mm²)\",VLOOKUP(Tabelas!T15,Tabelas!S29:X41,6,FALSE),IF(Ramal!F15=\"EPR/XLPE 90ºC (mm²)\",VLOOKUP(Tabelas!T15,Tabelas!S29:X41,5,FALSE),\"\"))","v":"3#16(16)T#16"}]
[null,null,null,null,null,null,null,null,null,null,null,null,null,null,null,null,null,null,null,null,null,null,"3#6(6)T#6","3#6(6)T#6",{"$f":"VLOOKUP(T15,S29:X41,3,FALSE)","v":70}]
[null,null,null,null,null,null,null,null,null,null,null,null,null,null,null,null,null,33,"T2",50,null,null,"3#10(10)T#10","3#10(10)T#10",{"$f":"VLOOKUP(T15,S29:X41,4,FALSE)","v":80}]
[null,null,null,null,null,null,null,null,null,null,null,null,null,null,null,null,null,45,"T3",63,70,80,"3#16(16)T#16","3#25(25)T#16"]
[null,null,null,null,null,null,null,null,null,null,null,null,null,null,null,null,null,65,"T4",100,null,null,"3#25(25)T#16","3#35(35)T#16"]
[null,null,null,null,null,null,null,null,null,null,null,null,null,null,null,null,null,82,"TE1",125,null,null,"3#35(35)T#16","3#50(50)T#25"]
[null,null,null,null,null,null,null,null,null,null,null,null,null,null,null,null,null,98,"TE2",150,null,null,"3#50(50)T#25","3#70(70)T#35"]
[null,null,null,null,null,null,null,null,null,null,null,null,null,null,null,null,null,115,"TE3",175,null,null,"3#70(70)T#35","3#95(95)T#50"]
[null,null,null,null,null,null,null,null,null,null,null,null,null,null,null,null,null,130,"TE4",200,null,null,"3#95(95)T#50","3#120(120)T#70"]
[null,null,null,null,null,null,null,null,null,null,null,null,null,null,null,null,null,160,"TE5",250,null,null,"3#150(150)T#70","3#185(185)T#95"]
[null,null,null,null,null,null,null,null,null,null,null,null,null,null,null,null,null,190,"TE6",300,null,null,"3x2x#50(50)T#50","3x2x#70(70)T#70"]

{"sheet":"ORIENTAÇÕES","index":17,"n_rows":25,"n_cols":7,"rows_kept":25,"cut":false,"hidden":false,"merged":[[4,1,19,14],[20,1,23,14],[24,1,31,14],[1,1,1,5],[1,6,1,14],[2,1,3,14]]}
[]
[null,null,null,null,null,null,"Orientações Esquema Vertical e Layout do PM "]
[null,"Orientações painel de medição"]
[]
[null,"Encaminhar o layout do PM em anexo aos arquivos, seguindo as orientações abaixo;\n\n1-  A caixa ou painel de medidor mais alta do centro de medição deve ser instalada com sua face superior a uma altura máxima de 2 m em relação ao piso acabado. \n2- A caixa ou painel de medidor mais baixa do centro de medição deve ser instalada com sua face inferior a uma altura mínima de 0,20 m em relação ao piso acabado. \n3- Cada uma das U.C. constituintes do(s) centro(s) de medição deve ser identificada, sequencialmente, da esquerda para a direita, obedecendo sempre a ordem de cima para baixo.\nObs.Para centro de medição em policarbonato, os condutores, tanto de fase quanto de neutro, dos ramais de medidores que saem da caixa de distribuição devem identificar a unidade consumidora por intermédio de anilhas plásticas fixadas nos próprios condutores.\n4- Dimensões das caixas de distribuição para painel em madeira repeitando a tabela 20 da NTD 6.07. \n5- Dimensões dos painéis de madeira respeitando a tabela 21 da NTD 6.07.\n6- Acrescentar as vistas: Frontal interna, Corte lateral e Frontal externa.\n7- Acrescentando as legendas referentes ao tipo de caixa, ao copex metálico(entrando pelo furo da esquerda), disjuntor utilizado e numeração dos apt´s.\n8- Representar junto ao painel o eletorduto que se segue para o aterramento, e o eletroduto de entrada."]
[]
[]
[]
[]
[]
[]
[]
[]
[]
[]
[]
[]
[]
[]
[]
[null,"Orientações esquema vertical "]
[]
[]
[]
[null,"Encaminhar os esquema vertical em anexo aos arquivos, seguindo as orientações abaixo;\n\n1- Apresentar Esquema vertical, no caso de edificação com mais de um piso.\nOBS. Para empreendimentos com apenas um piso, indicar o esquema do terreo.\n2- A vista em questão deve conter a posição dos apt´s, os eletordutos e cabos que seguem para as unidades, além do posicionameto do PM e da caixa de medição de incêndio(caso tenha)."]

{"sheet":"Painel madeiras","index":18,"n_rows":46,"n_cols":4,"rows_kept":46,"cut":false,"hidden":true,"merged":[]}
[]
[]
[]
[]
[]
[]
[]
[]
[]
[]
[]
[]
[]
[]
[]
[]
[]
[]
[]
[]
[]
[]
[]
[]
[]
[]
[]
[]
[]
[]
[]
[]
[]
[]
[]
[]
[]
[]
[]
[]
[]
[]
[]
[]
[]
[null,null,null,"Observações: A caixa de medição "]