{"text_format":"1","workbook":"xlsx","n_sheets":5,"sheets":["QT Rede Monofásica - 220 V","QT Rede Trifásica - 380V","Calculos_QT_380","Coeficientes","Coeficientes Mono"],"not_rendered":{"charts":0,"images":2,"macros":1,"external_links":0,"defined_names":0,"comments":0,"pivot_tables":0},"unopened":[],"bounds":{"document_bytes":16777216,"sheet_cells":100000,"rows_first":2000,"rows_last":500,"rows_between":2000,"halvings":0,"cell_chars":16384,"cell_head_chars":4096},"cells_cut":0,"cells_raw":0,"read":"whole","date_system":"1900"}

{"sheet":"QT Rede Monofásica - 220 V","index":0,"n_rows":25,"n_cols":19,"rows_kept":25,"cut":false,"hidden":true,"merged":[[8,11,10,11],[8,13,8,15],[8,16,10,16],[8,12,24,12],[11,10,24,10],[1,3,1,17],[2,3,2,17],[4,2,4,7],[5,2,5,7],[9,3,9,5],[8,17,24,17],[6,2,6,7],[10,3,10,5],[7,13,7,16],[8,3,8,6],[8,7,8,9],[8,10,10,10]]}
[]
[null,null,null,"UNIDADE DE PROJETO DE REDES - CELPE"]
[null,null,null,"Cálculo de Queda de Tensão Secundária Monofásica (220 V)"]
[null,null,null,null,null,null,null,null,"Preencher com os Trafos Monofásicos de Distribuição padronizados 10 ou 15 kVA"]
[null,null,"Digite potência transformador (kVA)",null,null,null,null,null,10]
[null,null,"Potência total do projeto (kVA)",null,null,null,null,null,{"$f":"SUM(H12:H25)","v":3.5999999999999992}]
[null,null,"Taxa de carregamento (%)",null,null,null,null,null,{"$f":"I6/I5","v":0.35999999999999993}]
[null,null,null,null,null,null,null,null,null,null,null,null,null,"QUEDA DE TENSÃO MONOFÁSICA"]
[null,null,null,"Trecho",null,null,null,"Carga",null,null,"Nível de tensão secundária de distribuição (V)","Escolha o Condutor por Trecho",null,"Queda de Tensão - Monofásica",null,null,"OBSERVAÇÃO"]
[null,null,null,"Nós",null,null,"Vão (m)","Distribuída trecho (kVA)","Acumulado no fim de trecho (kVA)","Total (kVA) - (C/2+D)*(B/100)",null,null,null,"Unitária (%)","No trecho (%)","Total (%)"]
[null,null,null,"A",null,null,"B","C","D","E",null,null,null,"G","H","I"]
[null,null,null,"Trafo","→","A",50,0.3,{"$f":"SUM(H12:$H$25)","v":3.5999999999999992},{"$f":"(H12/2+I12)*(G12/100)","v":1.8749999999999996},"220 V","1x25+1x25 NI",null,{"$f":"VLOOKUP($L:$L,'Coeficientes Mono'!$A:$G,2,0)","v":0.60361651838367436},{"$f":"J12*N12","v":1.1317809719693892},{"$f":"SUM($O$12:O12)","v":1.1317809719693892},{"$f":"IF(P12<5,\"CABO BEM DIMENSIONADO\",\"AJUSTE O CABO\")","v":"CABO BEM DIMENSIONADO"},null,"Caso apareça ajuste o Cabo, terá que ser dividido a distância e centralizado o trafo até este vão"]
[null,null,null,"A","→","B",50,0.3,{"$f":"SUM(H13:$H$25)","v":3.2999999999999994},{"$f":"(H13/2+I13)*(G13/100)","v":1.7249999999999996},null,"1x25+1x25 NI",null,{"$f":"VLOOKUP($L:$L,'Coeficientes Mono'!$A:$G,2,0)","v":0.60361651838367436},1.041238494211838,{"$f":"SUM($O$12:O13)","v":2.173019466181227},{"$f":"IF(P13<5,\"CABO BEM DIMENSIONADO\",\"AJUSTE O CABO\")","v":"CABO BEM DIMENSIONADO"}]
[null,null,null,"B","→","C",50,0.5,{"$f":"SUM(H14:$H$25)","v":2.9999999999999996},1.6249999999999998,null,"1x25+1x25 NI",null,{"$f":"VLOOKUP($L:$L,'Coeficientes Mono'!$A:$G,2,0)","v":0.60361651838367436},0.98087684237347073,{"$f":"SUM($O$12:O14)","v":3.1538963085546978},"CABO BEM DIMENSIONADO"]
[null,null,null,"C","→","D",50,0.3,{"$f":"SUM(H15:$H$25)","v":2.4999999999999996},1.3249999999999997,null,"1x25+1x25 NI",null,{"$f":"VLOOKUP($L:$L,'Coeficientes Mono'!$A:$G,2,0)","v":0.60361651838367436},0.79979188685836833,{"$f":"SUM($O$12:O15)","v":3.9536881954130663},"CABO BEM DIMENSIONADO"]
[null,null,null,"D","→","E",50,0.3,{"$f":"SUM(H16:$H$25)","v":2.2000000000000002},1.175,null,"1x25+1x25 NI",null,{"$f":"VLOOKUP($L:$L,'Coeficientes Mono'!$A:$G,2,0)","v":0.60361651838367436},0.70924940910081735,{"$f":"SUM($O$12:O16)","v":4.6629376045138837},"CABO BEM DIMENSIONADO"]
[null,null,null,"E","→","F",50,0.3,{"$f":"SUM(H17:$H$25)","v":1.9},1.0249999999999999,null,"1x25+1x25 NI",null,{"$f":"VLOOKUP($L:$L,'Coeficientes Mono'!$A:$G,2,0)","v":0.60361651838367436},0.61870693134326615,{"$f":"SUM($O$12:O17)","v":5.2816445358571498},"AJUSTE O CABO"]
[null,null,null,"F","→","G",50,0.3,{"$f":"SUM(H18:$H$25)","v":1.6},0.875,null,"1x25+1x25 NI",null,{"$f":"VLOOKUP($L:$L,'Coeficientes Mono'!$A:$G,2,0)","v":0.60361651838367436},0.52816445358571507,{"$f":"SUM($O$12:O18)","v":5.8098089894428648},"AJUSTE O CABO"]
[null,null,null,"G","→","H",50,0.3,{"$f":"SUM(H19:$H$25)","v":1.3},0.72499999999999998,null,"1x25+1x25 NI",null,{"$f":"VLOOKUP($L:$L,'Coeficientes Mono'!$A:$G,2,0)","v":0.60361651838367436},0.43762197582816392,{"$f":"SUM($O$12:O19)","v":6.2474309652710289},"AJUSTE O CABO"]
[null,null,null,"H","→","I",50,0.4,{"$f":"SUM(H20:$H$25)","v":1},0.6,null,"1x25+1x25 NI",null,{"$f":"VLOOKUP($L:$L,'Coeficientes Mono'!$A:$G,2,0)","v":0.60361651838367436},0.36216991103020463,{"$f":"SUM($O$12:O20)","v":6.6096008763012337},"AJUSTE O CABO"]
[null,null,null,"I","→","J",50,0.3,{"$f":"SUM(H21:$H$25)","v":0.6},0.375,null,"1x25+1x25 NI",null,{"$f":"VLOOKUP($L:$L,'Coeficientes Mono'!$A:$G,2,0)","v":0.60361651838367436},0.22635619439387789,{"$f":"SUM($O$12:O21)","v":6.8359570706951116},"AJUSTE O CABO"]
[null,null,null,"J","→","L",50,0.3,{"$f":"SUM(H22:$H$25)","v":0.3},0.22499999999999998,null,"1x25+1x25 NI",null,{"$f":"VLOOKUP($L:$L,'Coeficientes Mono'!$A:$G,2,0)","v":0.60361651838367436},0.13581371663632671,{"$f":"SUM($O$12:O22)","v":6.9717707873314385},"AJUSTE O CABO"]
[null,null,null,"L","→","M",50,null,{"$f":"SUM(H23:$H$25)","v":0},0,null,"1x25+1x25 NI",null,{"$f":"VLOOKUP($L:$L,'Coeficientes Mono'!$A:$G,2,0)","v":0.60361651838367436},0,{"$f":"SUM($O$12:O23)","v":6.9717707873314385},"AJUSTE O CABO"]
[null,null,null,"M","→","N",50,null,{"$f":"SUM(H24:$H$25)","v":0},0,null,"1x25+1x25 NI",null,{"$f":"VLOOKUP($L:$L,'Coeficientes Mono'!$A:$G,2,0)","v":0.60361651838367436},0,{"$f":"SUM($O$12:O24)","v":6.9717707873314385},"AJUSTE O CABO"]
[null,null,null,"N","→","O",50,null,{"$f":"SUM(H25:$H$25)","v":0},0,null,"1x25+1x25 NI",null,{"$f":"VLOOKUP($L:$L,'Coeficientes Mono'!$A:$G,2,0)","v":0.60361651838367436},0,{"$f":"SUM($O$12:O25)","v":6.9717707873314385},"AJUSTE O CABO"]

{"sheet":"QT Rede Trifásica - 380V","index":1,"n_rows":64,"n_cols":17,"rows_kept":64,"cut":false,"hidden":false,"merged":[[2,3,2,16],[7,17,7,22],[8,17,8,22],[9,17,9,22],[6,17,6,22],[4,3,4,9],[9,3,9,5],[8,3,8,5],[7,3,7,5],[5,3,6,5],[3,9,3,10],[5,16,7,16],[8,16,10,16],[5,12,6,14],[4,14,4,15],[47,16,49,16],[47,3,47,6],[47,7,47,9],[47,10,49,10],[47,11,49,11],[47,12,63,12],[48,3,48,5],[49,3,49,5],[50,10,63,10],[47,13,47,15],[46,13,46,16],[10,3,10,5],[3,3,3,7],[5,15,7,15],[8,15,10,15],[9,6,9,7],[10,6,10,7],[5,8,6,8],[5,9,6,9],[5,10,5,11],[5,6,6,7],[7,6,7,7],[8,6,8,7],[7,12,7,13],[8,12,8,13],[9,12,10,13],[9,14,10,14],[4,12,4,13]]}
[]
[]
[null,null,null,"Cálculo de Queda de Tensão Secundária Trifásica (380 V) - CELPE"]
[null,null,null,"Identifique o Transformador:",null,null,null,null,"T1","Potencia do trafo:",null,75]
[null,null,null,"Indicar circuito novo ou melhoramento/reforço de rede existente:",null,null,null,null,null,null,"Novo","Tensão Primária",13.8,null,"Tensão Secundária",null,"380/220"]
[null,null,null,"Porte da Residência",null,null,"Quantidade",null,"Demanda Diversificada","Sub Total Residencial","Cargas Comerciais",null,"Iluminação Pública",null,null,"kVA Total"]
[null,null,null,null,null,null,null,null,null,null,"Tipo","Demanda"]
[null,null,null,"Tipo A",null,null,null,null,null,null,null,null,"Qtd."]
[null,null,null,"Tipo B",null,null,null,null,null,null,null,null,"Pot. Lamp",null,null,"kVA% - Trafo"]
[null,null,null,"Tipo C",null,null,null,null,null,null,null,null,"kVA da Iluminação"]
[null,null,null,"Tipo D"]
[null,null,null,"Representação Gráfica do Circuito do Transformador"]
[]
[]
[]
[]
[]
[]
[]
[]
[]
[]
[]
[]
[]
[]
[]
[]
[]
[]
[]
[]
[]
[]
[]
[]
[]
[]
[]
[]
{"$rows_left_out":25}
{"sheet":"Calculos_QT_380","index":2,"n_rows":388,"n_cols":6,"rows_kept":388,"cut":false,"hidden":true,"merged":[]}
[null,"PONTO 1","PONTO 2","TRECHO ATUAL","TRECHO ANTERIOR","QUEDA DE TENSÃO TOTAL"]
[null,{"$f":"'QT Rede Trifásica - 380V'!D51","v":1},{"$f":"'QT Rede Trifásica - 380V'!F51","v":3},{"$f":"B2&C2","v":"13"},{"$f":"IFERROR(VLOOKUP(B2,C:D,2,0),\"\")","v":""},{"$f":"IF(E2=\"\",'QT Rede Trifásica - 380V'!O51,SUM('QT Rede Trifásica - 380V'!O51,VLOOKUP(E2,D:F,3,0)))","v":0.98963323938168479}]
[null,{"$f":"'QT Rede Trifásica - 380V'!D52","v":1},{"$f":"'QT Rede Trifásica - 380V'!F52","v":4},{"$f":"B3&C3","v":"14"},{"$f":"IFERROR(VLOOKUP(B3,C:D,2,0),\"\")","v":""},{"$f":"IF(E3=\"\",'QT Rede Trifásica - 380V'!O52,SUM('QT Rede Trifásica - 380V'!O52,VLOOKUP(E3,D:F,3,0)))","v":0.70688088527263204}]
[null,{"$f":"'QT Rede Trifásica - 380V'!D53","v":4},{"$f":"'QT Rede Trifásica - 380V'!F53","v":5},{"$f":"B4&C4","v":"45"},"14",{"$f":"IF(E4=\"\",'QT Rede Trifásica - 380V'!O53,SUM('QT Rede Trifásica - 380V'!O53,VLOOKUP(E4,D:F,3,0)))","v":1.2723855934907378}]
[null,{"$f":"'QT Rede Trifásica - 380V'!D54","v":4},{"$f":"'QT Rede Trifásica - 380V'!F54","v":7},{"$f":"B5&C5","v":"47"},"14",{"$f":"IF(E5=\"\",'QT Rede Trifásica - 380V'!O54,SUM('QT Rede Trifásica - 380V'!O54,VLOOKUP(E5,D:F,3,0)))","v":3.3598108169679208}]
[null,{"$f":"'QT Rede Trifásica - 380V'!D55","v":0},{"$f":"'QT Rede Trifásica - 380V'!F55","v":0},"00","00",{"$f":"IF(E6=\"\",'QT Rede Trifásica - 380V'!O55,SUM('QT Rede Trifásica - 380V'!O55,VLOOKUP(E6,D:F,3,0)))","v":0.70688088527263204}]
[null,{"$f":"'QT Rede Trifásica - 380V'!D56","v":0},{"$f":"'QT Rede Trifásica - 380V'!F56","v":0},"00","00",{"$f":"IF(E7=\"\",'QT Rede Trifásica - 380V'!O56,SUM('QT Rede Trifásica - 380V'!O56,VLOOKUP(E7,D:F,3,0)))","v":0.70688088527263204}]
[null,{"$f":"'QT Rede Trifásica - 380V'!D57","v":0},{"$f":"'QT Rede Trifásica - 380V'!F57","v":0},"00","00",{"$f":"IF(E8=\"\",'QT Rede Trifásica - 380V'!O57,SUM('QT Rede Trifásica - 380V'!O57,VLOOKUP(E8,D:F,3,0)))","v":0.70688088527263204}]
[null,{"$f":"'QT Rede Trifásica - 380V'!D58","v":0},{"$f":"'QT Rede Trifásica - 380V'!F58","v":0},"00","00",{"$f":"IF(E9=\"\",'QT Rede Trifásica - 380V'!O58,SUM('QT Rede Trifásica - 380V'!O58,VLOOKUP(E9,D:F,3,0)))","v":0.70688088527263204}]
[null,{"$f":"'QT Rede Trifásica - 380V'!D59","v":0},{"$f":"'QT Rede Trifásica - 380V'!F59","v":0},"00","00",{"$f":"IF(E10=\"\",'QT Rede Trifásica - 380V'!O59,SUM('QT Rede Trifásica - 380V'!O59,VLOOKUP(E10,D:F,3,0)))","v":0.70688088527263204}]
[null,{"$f":"'QT Rede Trifásica - 380V'!D60","v":0},{"$f":"'QT Rede Trifásica - 380V'!F60","v":0},"00","00",{"$f":"IF(E11=\"\",'QT Rede Trifásica - 380V'!O60,SUM('QT Rede Trifásica - 380V'!O60,VLOOKUP(E11,D:F,3,0)))","v":0.70688088527263204}]
[null,{"$f":"'QT Rede Trifásica - 380V'!D61","v":0},{"$f":"'QT Rede Trifásica - 380V'!F61","v":0},"00","00",{"$f":"IF(E12=\"\",'QT Rede Trifásica - 380V'!O61,SUM('QT Rede Trifásica - 380V'!O61,VLOOKUP(E12,D:F,3,0)))","v":0.70688088527263204}]
[null,{"$f":"'QT Rede Trifásica - 380V'!D62","v":0},{"$f":"'QT Rede Trifásica - 380V'!F62","v":0},"00","00",{"$f":"IF(E13=\"\",'QT Rede Trifásica - 380V'!O62,SUM('QT Rede Trifásica - 380V'!O62,VLOOKUP(E13,D:F,3,0)))","v":0.70688088527263204}]
[null,{"$f":"'QT Rede Trifásica - 380V'!D63","v":0},{"$f":"'QT Rede Trifásica - 380V'!F63","v":0},"00","00",{"$f":"IF(E14=\"\",'QT Rede Trifásica - 380V'!O63,SUM('QT Rede Trifásica - 380V'!O63,VLOOKUP(E14,D:F,3,0)))","v":0.70688088527263204}]
[null,{"$f":"'QT Rede Trifásica - 380V'!D64","v":0},{"$f":"'QT Rede Trifásica - 380V'!F64","v":0},"00","00",{"$f":"IF(E15=\"\",'QT Rede Trifásica - 380V'!O64,SUM('QT Rede Trifásica - 380V'!O64,VLOOKUP(E15,D:F,3,0)))","v":0.70688088527263204}]
[null,{"$f":"'QT Rede Trifásica - 380V'!D65","v":0},{"$f":"'QT Rede Trifásica - 380V'!F65","v":0},"00","00",{"$f":"IF(E16=\"\",'QT Rede Trifásica - 380V'!O65,SUM('QT Rede Trifásica - 380V'!O65,VLOOKUP(E16,D:F,3,0)))","v":0.70688088527263204}]
[null,{"$f":"'QT Rede Trifásica - 380V'!D66","v":0},{"$f":"'QT Rede Trifásica - 380V'!F66","v":0},"00","00",{"$f":"IF(E17=\"\",'QT Rede Trifásica - 380V'!O66,SUM('QT Rede Trifásica - 380V'!O66,VLOOKUP(E17,D:F,3,0)))","v":0.70688088527263204}]
[null,{"$f":"'QT Rede Trifásica - 380V'!D67","v":0},{"$f":"'QT Rede Trifásica - 380V'!F67","v":0},"00","00",{"$f":"IF(E18=\"\",'QT Rede Trifásica - 380V'!O67,SUM('QT Rede Trifásica - 380V'!O67,VLOOKUP(E18,D:F,3,0)))","v":0.70688088527263204}]
[null,{"$f":"'QT Rede Trifásica - 380V'!D68","v":0},{"$f":"'QT Rede Trifásica - 380V'!F68","v":0},"00","00",{"$f":"IF(E19=\"\",'QT Rede Trifásica - 380V'!O68,SUM('QT Rede Trifásica - 380V'!O68,VLOOKUP(E19,D:F,3,0)))","v":0.70688088527263204}]
[null,{"$f":"'QT Rede Trifásica - 380V'!D69","v":0},{"$f":"'QT Rede Trifásica - 380V'!F69","v":0},"00","00",{"$f":"IF(E20=\"\",'QT Rede Trifásica - 380V'!O69,SUM('QT Rede Trifásica - 380V'!O69,VLOOKUP(E20,D:F,3,0)))","v":0.70688088527263204}]
[null,{"$f":"'QT Rede Trifásica - 380V'!D70","v":0},{"$f":"'QT Rede Trifásica - 380V'!F70","v":0},"00","00",{"$f":"IF(E21=\"\",'QT Rede Trifásica - 380V'!O70,SUM('QT Rede Trifásica - 380V'!O70,VLOOKUP(E21,D:F,3,0)))","v":0.70688088527263204}]
[null,{"$f":"'QT Rede Trifásica - 380V'!D71","v":0},{"$f":"'QT Rede Trifásica - 380V'!F71","v":0},"00","00",{"$f":"IF(E22=\"\",'QT Rede Trifásica - 380V'!O71,SUM('QT Rede Trifásica - 380V'!O71,VLOOKUP(E22,D:F,3,0)))","v":0.70688088527263204}]
[null,{"$f":"'QT Rede Trifásica - 380V'!D72","v":0},{"$f":"'QT Rede Trifásica - 380V'!F72","v":0},"00","00",{"$f":"IF(E23=\"\",'QT Rede Trifásica - 380V'!O72,SUM('QT Rede Trifásica - 380V'!O72,VLOOKUP(E23,D:F,3,0)))","v":0.70688088527263204}]
[null,{"$f":"'QT Rede Trifásica - 380V'!D73","v":0},{"$f":"'QT Rede Trifásica - 380V'!F73","v":0},"00","00",{"$f":"IF(E24=\"\",'QT Rede Trifásica - 380V'!O73,SUM('QT Rede Trifásica - 380V'!O73,VLOOKUP(E24,D:F,3,0)))","v":0.70688088527263204}]
[null,{"$f":"'QT Rede Trifásica - 380V'!D74","v":0},{"$f":"'QT Rede Trifásica - 380V'!F74","v":0},"00","00",{"$f":"IF(E25=\"\",'QT Rede Trifásica - 380V'!O74,SUM('QT Rede Trifásica - 380V'!O74,VLOOKUP(E25,D:F,3,0)))","v":0.70688088527263204}]
[null,{"$f":"'QT Rede Trifásica - 380V'!D75","v":0},{"$f":"'QT Rede Trifásica - 380V'!F75","v":0},"00","00",{"$f":"IF(E26=\"\",'QT Rede Trifásica - 380V'!O75,SUM('QT Rede Trifásica - 380V'!O75,VLOOKUP(E26,D:F,3,0)))","v":0.70688088527263204}]
[null,{"$f":"'QT Rede Trifásica - 380V'!D76","v":0},{"$f":"'QT Rede Trifásica - 380V'!F76","v":0},"00","00",{"$f":"IF(E27=\"\",'QT Rede Trifásica - 380V'!O76,SUM('QT Rede Trifásica - 380V'!O76,VLOOKUP(E27,D:F,3,0)))","v":0.70688088527263204}]
[null,{"$f":"'QT Rede Trifásica - 380V'!D77","v":0},{"$f":"'QT Rede Trifásica - 380V'!F77","v":0},"00","00",{"$f":"IF(E28=\"\",'QT Rede Trifásica - 380V'!O77,SUM('QT Rede Trifásica - 380V'!O77,VLOOKUP(E28,D:F,3,0)))","v":0.70688088527263204}]
[null,{"$f":"'QT Rede Trifásica - 380V'!D78","v":0},{"$f":"'QT Rede Trifásica - 380V'!F78","v":0},"00","00",{"$f":"IF(E29=\"\",'QT Rede Trifásica - 380V'!O78,SUM('QT Rede Trifásica - 380V'!O78,VLOOKUP(E29,D:F,3,0)))","v":0.70688088527263204}]
[null,{"$f":"'QT Rede Trifásica - 380V'!D79","v":0},{"$f":"'QT Rede Trifásica - 380V'!F79","v":0},"00","00",{"$f":"IF(E30=\"\",'QT Rede Trifásica - 380V'!O79,SUM('QT Rede Trifásica - 380V'!O79,VLOOKUP(E30,D:F,3,0)))","v":0.70688088527263204}]
[null,{"$f":"'QT Rede Trifásica - 380V'!D80","v":0},{"$f":"'QT Rede Trifásica - 380V'!F80","v":0},"00","00",{"$f":"IF(E31=\"\",'QT Rede Trifásica - 380V'!O80,SUM('QT Rede Trifásica - 380V'!O80,VLOOKUP(E31,D:F,3,0)))","v":0.70688088527263204}]
[null,{"$f":"'QT Rede Trifásica - 380V'!D81","v":0},{"$f":"'QT Rede Trifásica - 380V'!F81","v":0},"00","00",{"$f":"IF(E32=\"\",'QT Rede Trifásica - 380V'!O81,SUM('QT Rede Trifásica - 380V'!O81,VLOOKUP(E32,D:F,3,0)))","v":0.70688088527263204}]
[null,{"$f":"'QT Rede Trifásica - 380V'!D82","v":0},{"$f":"'QT Rede Trifásica - 380V'!F82","v":0},"00","00",{"$f":"IF(E33=\"\",'QT Rede Trifásica - 380V'!O82,SUM('QT Rede Trifásica - 380V'!O82,VLOOKUP(E33,D:F,3,0)))","v":0.70688088527263204}]
[null,{"$f":"'QT Rede Trifásica - 380V'!D83","v":0},{"$f":"'QT Rede Trifásica - 380V'!F83","v":0},"00","00",{"$f":"IF(E34=\"\",'QT Rede Trifásica - 380V'!O83,SUM('QT Rede Trifásica - 380V'!O83,VLOOKUP(E34,D:F,3,0)))","v":0.70688088527263204}]
[null,{"$f":"'QT Rede Trifásica - 380V'!D84","v":0},{"$f":"'QT Rede Trifásica - 380V'!F84","v":0},"00","00",{"$f":"IF(E35=\"\",'QT Rede Trifásica - 380V'!O84,SUM('QT Rede Trifásica - 380V'!O84,VLOOKUP(E35,D:F,3,0)))","v":0.70688088527263204}]
[null,{"$f":"'QT Rede Trifásica - 380V'!D85","v":0},{"$f":"'QT Rede Trifásica - 380V'!F85","v":0},"00","00",{"$f":"IF(E36=\"\",'QT Rede Trifásica - 380V'!O85,SUM('QT Rede Trifásica - 380V'!O85,VLOOKUP(E36,D:F,3,0)))","v":0.70688088527263204}]
[null,{"$f":"'QT Rede Trifásica - 380V'!D86","v":0},{"$f":"'QT Rede Trifásica - 380V'!F86","v":0},"00","00",{"$f":"IF(E37=\"\",'QT Rede Trifásica - 380V'!O86,SUM('QT Rede Trifásica - 380V'!O86,VLOOKUP(E37,D:F,3,0)))","v":0.70688088527263204}]
[null,{"$f":"'QT Rede Trifásica - 380V'!D87","v":0},{"$f":"'QT Rede Trifásica - 380V'!F87","v":0},"00","00",{"$f":"IF(E38=\"\",'QT Rede Trifásica - 380V'!O87,SUM('QT Rede Trifásica - 380V'!O87,VLOOKUP(E38,D:F,3,0)))","v":0.70688088527263204}]
[null,{"$f":"'QT Rede Trifásica - 380V'!D88","v":0},{"$f":"'QT Rede Trifásica - 380V'!F88","v":0},"00","00",{"$f":"IF(E39=\"\",'QT Rede Trifásica - 380V'!O88,SUM('QT Rede Trifásica - 380V'!O88,VLOOKUP(E39,D:F,3,0)))","v":0.70688088527263204}]
[null,{"$f":"'QT Rede Trifásica - 380V'!D89","v":0},{"$f":"'QT Rede Trifásica - 380V'!F89","v":0},"00","00",{"$f":"IF(E40=\"\",'QT Rede Trifásica - 380V'!O89,SUM('QT Rede Trifásica - 380V'!O89,VLOOKUP(E40,D:F,3,0)))","v":0.70688088527263204}]
{"$rows_left_out":349}
{"sheet":"Coeficientes","index":3,"n_rows":17,"n_cols":9,"rows_kept":17,"cut":false,"hidden":false,"merged":[[1,1,1,3],[1,4,1,6],[0,1,0,6],[0,0,2,0]]}
["Cabos","Coeficiente de queda de tensão % / kVA x 100 m"]
[null,"220/127  V",null,null,"380/220 V"]
[null,"1F","2F","3F","1F","2F","3F"]
["3x35+1x35 NI",0.44215498861588143,0.43971887297612455,0.21985943648806228,0.44215498861588143,0.1473849962052938,7.3692498102646914E-2,"Cabos Padronizados","Cabo Multiplexado"]
["3x70+1x50 NI",0.21206426558178956,0.21089586742431418,0.10544793371215709,0.21206426558178956,7.0688088527263188E-2,3.5344044263631601E-2,"Cabos Padronizados","Cabo Multiplexado"]
["3x120+1x70 NI",0.1272154465579578,0.12651453500667428,6.3257267503337142E-2,0.1272154465579578,4.2405148852652591E-2,2.1202574426326302E-2,"Cabos Padronizados","Cabo Multiplexado"]
["4 CA",0.63949999999999996,0.72450000000000003,0.32290000000000002,0.63949999999999996,0.24279999999999999,0.1079,"Somente Existente","Cabo Nu"]
["1/0 CA",0.29409999999999997,0.3407,0.15140000000000001,0.29409999999999997,0.1142,5.0700000000000002E-2,"Somente Existente","Cabo Nu"]
["16 mm² - Cobre",0.52310000000000001,0.59340000000000004,0.26369999999999999,0.52310000000000001,0.19889999999999999,8.8400000000000006E-2,"Somente Existente","Cabo Nu"]
["35 mm² - Cobre",0.2848,0.3251,0.14449999999999999,0.2848,0.109,4.8399999999999999E-2,"Somente Existente","Cabo Nu"]
["70 mm² - Cobre",0.17660000000000001,0.20349999999999999,9.0399999999999994E-2,0.17660000000000001,6.8199999999999997E-2,3.0300000000000001E-2,"Somente Existente","Cabo Nu"]
[]
[]
["tipo de circuito"]
["Novo"]
["Existente"]
[" "]

{"sheet":"Coeficientes Mono","index":4,"n_rows":7,"n_cols":4,"rows_kept":7,"cut":false,"hidden":true,"merged":[[0,0,2,0]]}
["Cabos","Coeficiente de queda de tensão % / kVA x 100 m"]
[null,"220  V"]
[null,"1F"]
["1x25+1x25 NI",0.60361651838367436,"Somente Existente","Cabo Multiplexado"]
["4 CA",0.63949999999999996,"Somente Existente","Cabo Nu"]
["1/0 CA",0.29409999999999997,"Somente Existente","Cabo Nu"]
["16 mm² - Cobre",0.52310000000000001,"Somente Existente","Cabo Nu"]